*HEADING
 ECA8HFDK: DSLOAD, DSFLUX, SFILM, AND SRADIATION FOR COUPLED TEMP-DISP  [CGAX8T]
*PREPRINT,ECHO=YES,HISTORY=NO,MODEL=NO
*NODE,NSET=ALL
*NSET,NSET=FIX1
*NSET,NSET=FIX2
*NSET,NSET=FIX3
*NSET,NSET=FIX4
*ELEMENT,TYPE=CGAX8T, ELSET=EALL
*SOLID SECTION,MATERIAL=A1, ELSET=EALL
*PHYSICAL CONSTANTS, ABSOLUTE ZERO=-460., STEFAN BOLTZMANN=5.0E-8
*MATERIAL,NAME=A1
*ELASTIC
30.E6,0.3
*EXPANSION
0.,
*CONDUCTIVITY
3.77E-5,
*SPECIFIC HEAT
.39,
*DENSITY
82.9,
*INITIAL CONDITIONS,TYPE=VELOCITY
ALL,1,10.
ALL,2,5.
*SURFACE, NAME=SIDE1
 1, S1
*SURFACE, NAME=SIDE2
 1, S2
*SURFACE, NAME=SIDE3
 1, S3
*SURFACE, NAME=SIDE4
 1, S4
*STEP
*COUPLED TEMPERATURE-DISPL,STEADY STATE
*BOUNDARY,OP=NEW
ALL,1,2
ALL,5,5
FIX3,11
*EL PRINT
 LOADS,FLUXS
 FILM,RAD
*NODE PRINT
 RF,
 NT,
 RFL,
*DSFLUX,OP=NEW
 SIDE1,S,.3
*END STEP
*STEP
*COUPLED TEMPERATURE-DISPLACEMENT,STEADY STATE
1.,1.
*BOUNDARY,OP=NEW
ALL,1,2
ALL,5,5
FIX4,11
*DSLOAD,OP=NEW
SIDE1,P,100.
SIDE2,P,200.
SIDE3,P,300.
SIDE4,P,400.
*DSFLUX,OP=NEW
SIDE2,S,.3
*END STEP
*STEP
*COUPLED TEMPERATURE-DISPL,STEADY STATE
*BOUNDARY,OP=NEW
ALL,1,2
ALL,5,5
FIX1,11
*DSLOAD,OP=NEW
SIDE1,HP,3000.,3.,0.
*DSFLUX,OP=NEW
SIDE3,S,.3
*END STEP
*STEP
*COUPLED TEMPERATURE-DISPL,STEADY STATE
*SOLUTION TECHNIQUE,TYPE=SEPARATED
*BOUNDARY,OP=NEW
ALL,1,2
ALL,5,5
FIX2,11
*DSLOAD,OP=NEW
SIDE2,HP,3000.,3.,0.
*DSFLUX,OP=NEW
SIDE4,S,.3
*END STEP
*STEP
*COUPLED TEMPERATURE-DISPL,STEADY STATE
*DSLOAD,OP=NEW
SIDE3,HP,3000.,3.,0.
*DSFLUX,OP=NEW
*SFILM,OP=NEW
SIDE1,F,75.,.103
*BOUNDARY,OP=NEW
ALL,1,2
ALL,5,5
FIX3,11
*END STEP
*STEP
*COUPLED TEMPERATURE-DISPL,STEADY STATE
*DSLOAD,OP=NEW
SIDE4,HP,3000.,3.,0.
*SFILM,OP=NEW
SIDE2,F,75.,.103
*BOUNDARY,OP=NEW
ALL,1,2
ALL,5,5
FIX4,11
*END STEP
*STEP
*COUPLED TEMPERATURE-DISPL,STEADY STATE
*DSLOAD,OP=NEW
*SFILM,OP=NEW
SIDE3,F,75.,.103
*BOUNDARY,OP=NEW
ALL,1,2
ALL,5,5
FIX1,11
*END STEP
*STEP
*COUPLED TEMPERATURE-DISPL,STEADY STATE
*SFILM,OP=NEW
SIDE4,F,75.,.103
*BOUNDARY,OP=NEW
ALL,1,2
ALL,5,5
FIX2,11
*END STEP
*STEP
*COUPLED TEMPERATURE-DISPL,STEADY STATE
*SFILM,OP=NEW
*SRADIATE,OP=NEW
SIDE1,R,75.,1.0
*BOUNDARY,OP=NEW
ALL,1,2
ALL,5,5
FIX3,11
*END STEP
*STEP
*COUPLED TEMPERATURE-DISPL,STEADY STATE
*SRADIATE,OP=NEW
SIDE2,R,75.,1.0
*BOUNDARY,OP=NEW
ALL,1,2
ALL,5,5
FIX4,11
*END STEP
*STEP
*COUPLED TEMPERATURE-DISPL,STEADY STATE
*SRADIATE, OP=NEW
SIDE3,R,75.,1.0
*BOUNDARY,OP=NEW
ALL,1,2
ALL,5,5
FIX1,11
*END STEP
*STEP
*COUPLED TEMPERATURE-DISPL,STEADY STATE
*SRADIATE,OP=NEW
SIDE4,R,75.,1.0
*BOUNDARY,OP=NEW
ALL,1,2
ALL,5,5
FIX2,11
*END STEP