*Heading
** Job name: cylcammech Model name: Model-1
**
** PARTS
**
*Part, name=cyl_bottom
*End Part
*Part, name=cyl_center
*End Part
*Part, name=cylinder
*End Part
*Part, name=pinHead
*End Part
*Part, name=pinTail
*End Part
*Part, name=pin_head
*End Part
*Part, name=pin_tail
*End Part
*Part, name=slot
*End Part
*Part, name=track
*End Part
**
** ASSEMBLY
**
*Assembly, name=Assembly
**
*Instance, name=cyl_bottom-1, part=cyl_bottom
** Region: (mass_zero:Picked)
*Element, type=MASS, elset=_I1_MASS_
*Mass, elset=_I1_MASS_
1e-05,
*Element, type=ROTARYI, elset=_I1_ROTARYI_
*RotaryI, elset=_I1_ROTARYI_
*Node
*Nset, nset=cyl_bottom-1-RefPt_, internal
*End Instance
**
*Instance, name=cyl_center-1, part=cyl_center
** Region: (mass_zero:Picked)
*Element, type=MASS, elset=_I1_MASS_
*Mass, elset=_I1_MASS_
1e-05,
*Element, type=ROTARYI, elset=_I1_ROTARYI_
*RotaryI, elset=_I1_ROTARYI_
*Node
*Nset, nset=cyl_center-1-RefPt_, internal
*End Instance
**
*Instance, name=pin_head-1, part=pin_head
** Region: (mass_zero:Picked)
*Element, type=MASS, elset=_I1_MASS_
*Mass, elset=_I1_MASS_
1e-05,
*Element, type=ROTARYI, elset=_I1_ROTARYI_
*RotaryI, elset=_I1_ROTARYI_
*Node
*Nset, nset=pin_head-1-RefPt_, internal
*End Instance
**
*Instance, name=pin_tail-1, part=pin_tail
** Region: (mass_pin:Picked)
*Element, type=MASS, elset=_I1_MASS_
*Mass, elset=_I1_MASS_
0.00777025,
*Element, type=ROTARYI, elset=_I1_ROTARYI_
*RotaryI, elset=_I1_ROTARYI_
*Node
*Nset, nset=pin_tail-1-RefPt_, internal
*End Instance
**
*Instance, name=track-1, part=track
** Region: (mass_zero:Picked)
*Element, type=MASS, elset=_I1_MASS_
*Mass, elset=_I1_MASS_
1e-05,
*Element, type=ROTARYI, elset=_I1_ROTARYI_
*RotaryI, elset=_I1_ROTARYI_
*Node
*Nset, nset=track-1-RefPt_, internal
*End Instance
**
*Instance, name=cylinder-1, part=cylinder
*Node
*Element, type=S3
*Element, type=B31
*End Instance
**
*Instance, name=pinHead-1, part=pinHead
*Node
*Element, type=S3
*Element, type=B31
*End Instance
**
*Instance, name=pinTail-1, part=pinTail
*Node
*Element, type=S3
*Element, type=B31
*End Instance
**
*Instance, name=slot-1, part=slot
*Node
*Element, type=S3
*Element, type=B31
*End Instance
*Nset, nset=track, instance=track-1
*Nset, nset=_PickedSet15, internal, instance=cyl_bottom-1
*Nset, nset=cylinder, instance=cyl_bottom-1
*Orientation, name="Datum csys-3"
*Orientation, name="Datum csys-2"
** Constraint: Constraint-1
*Display Body, instance=cylinder-1
cyl_bottom-1.1,
** Constraint: Constraint-2
*Display Body, instance=pinHead-1
pin_head-1.1,
** Constraint: Constraint-3
*Display Body, instance=pinTail-1
pin_head-1.1,
** Constraint: Constraint-4
*Display Body, instance=slot-1
track-1.1,
**
** CONNECTORS
**
*Element, type=CONN3D2, elset=_center-bottom_CnSet_
1, cyl_center-1.1, cyl_bottom-1.1
*Connector Section, elset=_center-bottom_CnSet_
Beam,
*Element, type=CONN3D2, elset=_slot_CnSet_
2, cyl_center-1.1, pin_head-1.1
*Connector Section, elset=_slot_CnSet_, behavior=ConnProp-3
Cartesian,
"Datum csys-3",
*Element, type=CONN3D2, elset=_tail_head_CnSet_
3, pin_tail-1.1, pin_head-1.1
*Connector Section, elset=_tail_head_CnSet_
Beam,
*Element, type=CONN3D2, elset=_track_CnSet_
4, track-1.1, pin_tail-1.1
*Connector Section, elset=_track_CnSet_, behavior=ConnProp-2
Slot, Align
"Datum csys-2",
*End Assembly
**
** MATERIALS
**
*Material, name=Material-1
*Density
 1e-05,
*Elastic
1.,0.
*Connector Behavior, name=ConnProp-2
*Connector Damping, component=1
*Connector Behavior, name=ConnProp-3
*Connector Stop, component=1
** ----------------------------------------------------------------
**
** STEP: Step-1
**
*Step, name=Step-1
*Dynamic, Explicit, direct user control
0.0001, 4.
*Bulk Viscosity
**
** BOUNDARY CONDITIONS
**
** Name: BC-1 Type: Displacement/Rotation
*Boundary
track, 1, 1
track, 2, 2
track, 3, 3
track, 4, 4
track, 5, 5
track, 6, 6
** Name: BC-2 Type: Velocity/Angular velocity
*Boundary, type=VELOCITY
_PickedSet15, 1, 1
_PickedSet15, 2, 2
_PickedSet15, 3, 3
_PickedSet15, 4, 4
_PickedSet15, 5, 5
_PickedSet15, 6, 6, 3.14159
**
** OUTPUT REQUESTS
**
*Restart, write, number interval=1, time marks=NO
**
** FIELD OUTPUT: F-Output-1
**
*Output, field, variable=PRESELECT
**
** HISTORY OUTPUT: H-Output-1
**
*Output, history, frequency=200
*Node Output, nset=cylinder
RF1, RF2, RF3, RM1, RM2, RM3
*End Step