*Heading
*parameter
 thick = 0.999999
*preprint, model=yes
** ----------------------------------------------------------------
** PART INSTANCE: PART-1-1
**
*Node
*Element, type=S4
*Elset, elset=ASSEMBLY_PART-1-1__PICKEDSET2
*shellsection, elset=ASSEMBLY_PART-1-1__PICKEDSET2, material=MATERIAL-1
 <thick>, 5
** ----------------------------------------------------------------
** PART INSTANCE: PART-1-2
**
*Node
**------------------------------------------------
** victor - changed back
**1355, 1.25, 0, 25
**1355, 10, 0, 35
**------------------------------------------------
*Element, type=S4
*Elset, elset=ASSEMBLY_PART-1-2__PICKEDSET2
*shellsection, elset=ASSEMBLY_PART-1-2__PICKEDSET2, material=MATERIAL-1
 <thick>, 5
*Node
**
** Assembly Nsets
**
*Nset, nset=ASSEMBLY__PICKEDSET10
*Nset, nset=ASSEMBLY__PICKEDSET11
*Nset, nset=ASSEMBLY__PICKEDSET12
*Nset, nset=ASSEMBLY__PICKEDSET13
*Nset, nset=ASSEMBLY__PICKEDSET14
*Nset, nset=ASSEMBLY__PICKEDSET15
*Nset, nset=ASSEMBLY__PICKEDSET16
*Nset, nset=ASSEMBLY__PICKEDSET17
*Nset, nset=ASSEMBLY__PICKEDSET18
*Nset, nset=ASSEMBLY__PICKEDSET19
**
** Assembly Elsets
**
*Elset, elset=ASSEMBLY__PICKEDSET11
*Elset, elset=ASSEMBLY__PICKEDSET13
*Elset, elset=ASSEMBLY__PICKEDSET15
*Elset, elset=ASSEMBLY__PICKEDSET17
*Elset, elset=ASSEMBLY__PICKEDSET2
*Elset, elset=ASSEMBLY__PICKEDSET3
*material, name=MATERIAL-1
*ELASTIC
  2.070000e+05,   3.000000e-01
*PLASTIC
    292.0000,   0.0000e+00
    306.3399,   8.1205e-03
    325.2581,   2.0301e-02
    343.8255,   3.8573e-02
    364.3499,   6.5979e-02
    388.5583,   1.0709e-01
    416.8968,   1.6875e-01
    451.1431,   2.6125e-01
*surface, name=up
ASSEMBLY__PICKEDSET2, spos
*surface, name=down
ASSEMBLY__PICKEDSET3, spos
*contact pair, interaction=smooth, type=surface to surface
 up, down
*surfaceinteraction, name=smooth
*nset, nset=swpset
*fastener, INTERACTION NAME=SWP, REFERENCE NODE SET=SWPSET,PROPERTY=SWPPROP,coupling=structural
**up,down
*fastener property, NAME=SWPPROP
**
*elset, elset=rigid-1
ASSEMBLY__PICKEDSET11, ASSEMBLY__PICKEDSET15
*elset, elset=rigid-2
ASSEMBLY__PICKEDSET13, ASSEMBLY__PICKEDSET17
*rigidbody, refnode=ASSEMBLY__PICKEDSET10, position=CENTEROFMASS, elset=rigid-1
*rigidbody, refnode=ASSEMBLY__PICKEDSET12, position=CENTEROFMASS, elset=rigid-2
*amplitude, name=ramp
0.0, 0.0, 0.5, 1.0, 1., 0.0
*Step, name=Step-1, nlgeom, inc=300
*static
 1.25e-3, 1.
*contact controls, stiffness=1.e-2
*boundary, amplitude=ramp
ASSEMBLY__PICKEDSET10, 1, 1
ASSEMBLY__PICKEDSET10, 2, 2, 5.
ASSEMBLY__PICKEDSET10, 3, 3
ASSEMBLY__PICKEDSET10, 4, 4, 0.5
ASSEMBLY__PICKEDSET10, 5, 5, 0.0
ASSEMBLY__PICKEDSET10, 6, 6
*boundary, amplitude=ramp
ASSEMBLY__PICKEDSET12, 1, 1
ASSEMBLY__PICKEDSET12, 2, 2, -5.
ASSEMBLY__PICKEDSET12, 3, 3
ASSEMBLY__PICKEDSET12, 4, 4,
ASSEMBLY__PICKEDSET12, 5, 5
ASSEMBLY__PICKEDSET12, 6, 6
*output, field, freq=3
*node output
 U,
*contact output
 cstress,
*nset, nset=QA_TEST
 ASSEMBLY__PICKEDSET10,
*output, history
*node output, nset=ASSEMBLY__PICKEDSET10
 RF, U
*interaction output, nset=swpset
 FTF,
*interaction output, name=swp
 FTF,
*endstep