*Heading
*preprint, model=yes
** ----------------------------------------------------------------
** PART INSTANCE: PART-1-1
**
*Node
*Element, type=S4R
*Elset, elset=ASSEMBLY_PART-1-1__PICKEDSET2
*shellsection, elset=ASSEMBLY_PART-1-1__PICKEDSET2, material=MATERIAL-1
** ----------------------------------------------------------------
** PART INSTANCE: PART-1-2
**
*Node
**------------------------------------------------
**------------------------------------------------
*Element, type=S4R
*Elset, elset=ASSEMBLY_PART-1-2__PICKEDSET2
*shellsection, elset=ASSEMBLY_PART-1-2__PICKEDSET2, material=MATERIAL-1
*Node
**
** Assembly Nsets
**
*Nset, nset=ASSEMBLY__PICKEDSET10
*Nset, nset=ASSEMBLY__PICKEDSET11
*Nset, nset=ASSEMBLY__PICKEDSET12
*Nset, nset=ASSEMBLY__PICKEDSET13
*Nset, nset=ASSEMBLY__PICKEDSET14
*Nset, nset=ASSEMBLY__PICKEDSET15
*Nset, nset=ASSEMBLY__PICKEDSET16
*Nset, nset=ASSEMBLY__PICKEDSET17
*Nset, nset=ASSEMBLY__PICKEDSET18
*Nset, nset=ASSEMBLY__PICKEDSET19
**
** Assembly Elsets
**
*Elset, elset=ASSEMBLY__PICKEDSET11
*Elset, elset=ASSEMBLY__PICKEDSET13
*Elset, elset=ASSEMBLY__PICKEDSET15
*Elset, elset=ASSEMBLY__PICKEDSET17
*material, name=MATERIAL-1
*DENSITY
  7.850000e-09,
*ELASTIC
  2.070000e+05,   3.000000e-01
*PLASTIC
    292.0000,   0.0000e+00
    306.3399,   8.1205e-03
    325.2581,   2.0301e-02
    343.8255,   3.8573e-02
    364.3499,   6.5979e-02
    388.5583,   1.0709e-01
    416.8968,   1.6875e-01
    451.1431,   2.6125e-01
*surfaceinteraction, name=INTPROP-1
**
Ue
*elset,elset=up
*surface, name=up
up,
*elset,elset=down
*surface, name=down
down
*COUPLING, CONSTRAINT NAME=up  , REF NODE=1355, SURFACE=up
*DISTRIBUTING
*COUPLING, CONSTRAINT NAME=down, REF NODE=1356, SURFACE=down
*DISTRIBUTING
*MPC
BEAM,1356,1355
**
*elset, elset=rigid-1
ASSEMBLY__PICKEDSET11, ASSEMBLY__PICKEDSET15
*elset, elset=rigid-2
ASSEMBLY__PICKEDSET13, ASSEMBLY__PICKEDSET17
*rigidbody, refnode=ASSEMBLY__PICKEDSET10, position=CENTEROFMASS, elset=rigid-1
*rigidbody, refnode=ASSEMBLY__PICKEDSET12, position=CENTEROFMASS, elset=rigid-2
*amplitude, name=ramp
0.0, 0.0, 0.01, 1.0, 0.015, 0.5, 0.02, 0.0
*Step, name=Step-1
*dynamic, explicit
, 0.02
*bulkviscosity
*boundary, amplitude=ramp
ASSEMBLY__PICKEDSET10, 1, 1
ASSEMBLY__PICKEDSET10, 2, 2, 5.
ASSEMBLY__PICKEDSET10, 3, 3
ASSEMBLY__PICKEDSET10, 4, 4, 0.5
ASSEMBLY__PICKEDSET10, 5, 5, 0.0
ASSEMBLY__PICKEDSET10, 6, 6
*boundary, amplitude=ramp
ASSEMBLY__PICKEDSET12, 1, 1
ASSEMBLY__PICKEDSET12, 2, 2, -5.
ASSEMBLY__PICKEDSET12, 3, 3
ASSEMBLY__PICKEDSET12, 4, 4,
ASSEMBLY__PICKEDSET12, 5, 5
ASSEMBLY__PICKEDSET12, 6, 6
*nset, nset=QA_TEST
ASSEMBLY__PICKEDSET10,
*contact, op=NEW
*contactinclusions, allelementbased
*contactpropertyassignment
, , INTPROP-1
*output, field, number interval=20
*node output
U,
*node output, nset=QA_TEST
U,
*contact output
Cforce,
*output, history, time interval=2.e-4
*node output, nset=ASSEMBLY__PICKEDSET10
RF, U
*energy output, var=ALL
*endstep