*Heading
** continuity of pressure for coh2d4p with tie
*Preprint, echo=NO, model=yes, history=NO, contact=debug
*parameter
 Emod   = 1.E8
 thick  = 0.01325e-1
 width  = 1.0
halfthick = 1.e-2/2
**
** PARTS
**
*Part, name=Part-1
*End Part
**
*Part, name=cohesive
*End Part
**
**
** ASSEMBLY
**
*Assembly, name=Assembly
**
*Instance, name=Part-1-1, part=Part-1
*Node
*Element, type=CPE4P
*Nset, nset=_PickedSet2, internal, generate
*Elset, elset=_PickedSet2, internal, generate
** Region: (Section-1:Picked)
*Elset, elset=_PickedSet2, internal, generate
** Section: Section-1
*Solid Section, elset=_PickedSet2, material=Material-1
1.,
*End Instance
**
*Instance, name=cohesive-1, part=cohesive
*Node
      1000001,         -15., <halfthick>
      1000002,  -14.8999996, <halfthick>
      1000003,  -14.8000002, <halfthick>
      1000004,  -14.6999998, <halfthick>
      1000005,  -14.6000004, <halfthick>
      1000006,        -14.5, <halfthick>
      1000007,  -14.3999996, <halfthick>
      1000008,  -14.3000002, <halfthick>
      1000009,  -14.1999998, <halfthick>
      1000010,  -14.1000004, <halfthick>
     1000011,         -14., <halfthick>
     1000012,  -13.8999996, <halfthick>
     1000013,  -13.8000002, <halfthick>
     1000014,  -13.6999998, <halfthick>
     1000015,  -13.6000004, <halfthick>
     1000016,        -13.5, <halfthick>
     1000017,  -13.3999996, <halfthick>
     1000018,  -13.3000002, <halfthick>
     1000019,  -13.1999998, <halfthick>
     1000020,  -13.1000004, <halfthick>
** ... 281 like lines cut
*ELEMENT,TYPE=COH2D4P,ELSET=inter
*Nset, nset=_PickedSet2, internal, generate
*Elset, elset=_PickedSet2, internal, generate
** Region: (Section-2:Picked)
*Elset, elset=_PickedSet2, internal, generate
** Section: Section-2
***Gasket Section, elset=_PickedSet2, behavior=Material-2
** , 0., 0., 1.
*COHESIVE SECTION,ELSET=inter,MATERIAL=MAT1,RESPONSE=TRACTION SEPARATION,
THICKNESS=SPECIFIED,CONTROLS=VISCO
<thick>,1.0
*End Instance
**
*Instance, name=Part-1-2, part=Part-1
*Node
*Element, type=CPE4P
*Nset, nset=_PickedSet2, internal, generate
*Elset, elset=_PickedSet2, internal, generate
** Region: (Section-1:Picked)
*Elset, elset=_PickedSet2, internal, generate
** Section: Section-1
*Solid Section, elset=_PickedSet2, material=Material-1
1.,
*End Instance
**
*Nset, nset=top, instance=Part-1-1, generate
*Elset, elset=top, instance=Part-1-1, generate
*Nset, nset=bottom, instance=Part-1-2, generate
*Elset, elset=bottom, instance=Part-1-2, generate
*Nset, nset=all, instance=Part-1-1, generate
*Nset, nset=all, instance=cohesive-1, generate
*Nset, nset=all, instance=Part-1-2, generate
*Elset, elset=all, instance=Part-1-1, generate
*Elset, elset=all, instance=cohesive-1, generate
*Elset, elset=all, instance=Part-1-2, generate
*Elset, elset=_A_S2, internal, instance=Part-1-1, generate
*Surface, type=ELEMENT, name=A
_A_S2, S2
*Elset, elset=_D_S4, internal, instance=Part-1-2, generate
*Surface, type=ELEMENT, name=D
_D_S4, S4
*Elset, elset=SCOH, internal, instance=cohesive-1, generate
*Surface, type=ELEMENT, name=SCOHT
SCOH,S3
*Surface, type=ELEMENT, name=SCOHB
SCOH,S1
*Surface, type=NODE, name=B_CNS_, internal
B, 1.
*Surface, type=NODE, name=C_CNS_, internal
C, 1.
*Nset, nset=C, instance=cohesive-1, generate
*Nset, nset=B, instance=cohesive-1, generate
** Constraint: Constraint-1
**Tie, name=Constraint-1, adjust=yes, tied nset=B
**B_CNS_, A
** Constraint: Constraint-2
***Tie, name=Constraint-2, adjust=yes, tied nset=C
**C_CNS_, D
*Tie, name=Constraint-1, adjust=yes
SCOHT, A
** Constraint: Constraint-2
*Tie, name=Constraint-2, adjust=yes
SCOHB, D
*End Assembly
**
*SECTION CONTROLS,NAME=VISCO,VISCOSITY=1.D-3,ELEMENT DELETION=NO
**
** MATERIALS
**
*Material, name=Material-1
*Elastic
1.E3, 0.3
*Permeability, specific=1.
 1.e2
**
*MATERIAL,NAME=MAT1
*ELASTIC,TYPE=TRACTION
<Emod>,<Emod>
**
*INITIAL CONDITIONS, TYPE=RATIO
 all,1.
** ----------------------------------------------------------------
**
** STEP: Step-1
**
*Step, name=Step-1, nlgeom=YES, unsymm=YES
*Soils, consolidation, end=PERIOD, utol=1e+06
**0.15, 1., 1e-05, 1.,
**
** BOUNDARY CONDITIONS
**
** Name: BC-1 Type: Symmetry/Antisymmetry/Encastre
*Boundary
top, ENCASTRE
bottom, ENCASTRE
*boundary
top,8,8,1.0
bottom,8,8,0.0
**
** FIELD OUTPUT: F-Output-1
**
*Output, field
*node output
POR,
*element output
flvel,
**
*End Step