*Heading
** Job name: Job-01 Model name: Model-1
*Preprint, echo=NO, model=YES, history=YES, contact=YES
**
** PARTS
**
*Part, name=Part-1
*End Part
**
*Part, name=Part-2
*End Part
**
**
** ASSEMBLY
**
*Assembly, name=Assembly
**
*Instance, name=Part-1-1, part=Part-1
*Node
*Element, type=C3D4
*Nset, nset=_PickedSet2, internal, generate
*Elset, elset=_PickedSet2, internal, generate
** Region: (Section-1:Picked)
*Elset, elset=_PickedSet2, internal, generate
** Section: Section-1
*Solid Section, elset=_PickedSet2, material=Material-1
1.,
*End Instance
**
*Instance, name=Part-2-1, part=Part-2
*Node
*Element, type=C3D4
*Nset, nset=_PickedSet2, internal, generate
*Elset, elset=_PickedSet2, internal, generate
** Region: (Section-1:Picked)
*Elset, elset=_PickedSet2, internal, generate
** Section: Section-1
*Solid Section, elset=_PickedSet2, material=Material-1
1.,
*End Instance
**
*Node
*Nset, nset=_PickedSet10, internal
*Nset, nset=_PickedSet11, internal, instance=Part-1-1
*Elset, elset=_PickedSet11, internal, instance=Part-1-1
*Nset, nset=_PickedSet12, internal
*Nset, nset=_PickedSet13, internal
*Elset, elset=__PickedSurf9_S1, internal, instance=Part-2-1
*Elset, elset=__PickedSurf9_S3, internal, instance=Part-2-1
*Elset, elset=__PickedSurf9_S4, internal, instance=Part-2-1
*Elset, elset=__PickedSurf9_S2, internal, instance=Part-2-1
*Surface, type=ELEMENT, name=_PickedSurf9, internal
__PickedSurf9_S1, S1
__PickedSurf9_S3, S3
__PickedSurf9_S4, S4
__PickedSurf9_S2, S2
*Elset, elset=__PickedSurf22_S3, internal, instance=Part-1-1
*Elset, elset=__PickedSurf22_S1, internal, instance=Part-1-1
*Elset, elset=__PickedSurf22_S4, internal, instance=Part-1-1
*Elset, elset=__PickedSurf22_S2, internal, instance=Part-1-1
*Surface, type=ELEMENT, name=_PickedSurf22, internal
__PickedSurf22_S3, S3
__PickedSurf22_S1, S1
__PickedSurf22_S4, S4
__PickedSurf22_S2, S2
*Elset, elset=__PickedSurf23_S1, internal, instance=Part-2-1
*Elset, elset=__PickedSurf23_S3, internal, instance=Part-2-1
*Elset, elset=__PickedSurf23_S2, internal, instance=Part-2-1
*Elset, elset=__PickedSurf23_S4, internal, instance=Part-2-1
*Surface, type=ELEMENT, name=_PickedSurf23, internal
__PickedSurf23_S1, S1
__PickedSurf23_S3, S3
__PickedSurf23_S2, S2
__PickedSurf23_S4, S4
** Constraint: Constraint-1
*Coupling, constraint name=Constraint-1, ref node=_PickedSet10, surface=_PickedSurf9
*Kinematic
*End Assembly
**
** MATERIALS
**
*Material, name=Material-1
*Hyperelastic, neo hooke
100., 0.001
**
** INTERACTION PROPERTIES
**
*Surface Interaction, name=contact_only
1.,
**
** BOUNDARY CONDITIONS
**
** Name: BC-1 Type: Symmetry/Antisymmetry/Encastre
*Boundary
_PickedSet11, ENCASTRE
**
** INTERACTIONS
**
** Interaction: Int-1
*Contact Pair, interaction=contact_only, type=surface
_PickedSurf23, _PickedSurf22
** ----------------------------------------------------------------
**
** STEP: Step-1
**
*Step, name=Step-1, nlgeom=YES
Push together
*Static
1., 1.
**
** BOUNDARY CONDITIONS
**
** Name: BC-2 Type: Displacement/Rotation
*Boundary
_PickedSet12, 1, 1, -0.1
_PickedSet12, 2, 2
_PickedSet12, 3, 3
_PickedSet12, 4, 4
_PickedSet12, 5, 5
_PickedSet12, 6, 6
*contact controls, stiff=0.01
**
** OUTPUT REQUESTS
**
*Restart, write, frequency=0
**
** FIELD OUTPUT: F-Output-1
**
*Output, field, variable=PRESELECT, freq=10
**
** HISTORY OUTPUT: H-Output-1
**
*Output, history, variable=PRESELECT, freq=10
*End Step
** ----------------------------------------------------------------
**
** STEP: Step-2
**
*Step, name=Step-2, nlgeom=YES, inc=1000
Twist one block
*Static
1., 100., 0.001, 1.
**
** BOUNDARY CONDITIONS
**
** Name: BC-1 Type: Symmetry/Antisymmetry/Encastre
*Boundary, op=NEW
_PickedSet11, ENCASTRE
** Name: BC-2 Type: Displacement/Rotation
*Boundary, op=NEW
_PickedSet12, 1, 1, -0.1
_PickedSet12, 2, 2
_PickedSet12, 3, 3
_PickedSet12, 5, 5
_PickedSet12, 6, 6
** Name: BC-3 Type: Displacement/Rotation
*Boundary, op=NEW
_PickedSet13, 4, 4, 1.5708
**
** OUTPUT REQUESTS
**
*Restart, write, frequency=0
**
** FIELD OUTPUT: F-Output-1
**
*Output, field, variable=PRESELECT, freq=10
**
** HISTORY OUTPUT: H-Output-1
**
*Output, history, variable=PRESELECT, freq=10
*End Step