*Heading
** Job name: Job-1 Model name: Model-1
*Preprint, echo=NO, model=NO, history=NO, contact=NO
**
** PARTS
**
*Part, name=Part-1
*End Part
**
*Part, name=Part-2
*End Part
**
**
** ASSEMBLY
**
*Assembly, name=Assembly
**
*Instance, name=Part-1-1, part=Part-1
*Node
*Element, type=S8RT
*Element, type=S8RT
*Nset, nset=_PickedSet2, internal, generate
*Elset, elset=_PickedSet2, internal, generate
** Region: (Section-2:Picked)
*Elset, elset=_PickedSet2, internal, generate
** Section: Section-2
*Shell Section, elset=_PickedSet2, material=Material-1
3., 5
*End Instance
**
*Instance, name=Part-1-2, part=Part-1
*Node
*Element, type=S8RT
*Nset, nset=_PickedSet2, internal, generate
*Elset, elset=_PickedSet2, internal, generate
** Region: (Section-2:Picked)
*Elset, elset=_PickedSet2, internal, generate
** Section: Section-2
*Shell Section, elset=_PickedSet2, material=Material-1
3., 5
*End Instance
**
*Instance, name=Part-2-1, part=Part-2
*Node
*Element, type=B31H
*Nset, nset=excitation1
*Nset, nset=_PickedSet2, internal, generate
*Elset, elset=_PickedSet2, internal, generate
*Nset, nset=_PickedSet3, internal, generate
*Elset, elset=_PickedSet3, internal, generate
** Region: (Section-1:Picked), (Beam Orientation:Picked)
*Elset, elset=_PickedSet2, internal, generate
** Section: Section-1  Profile: Profile-1
*Beam Section, elset=_PickedSet2, material=Material-1, temperature=GRADIENTS, section=CIRC
2.
0.,0.,-1.
*End Instance
**
*Instance, name=Part-2-2, part=Part-2
*Node
*Element, type=B33H
*Nset, nset=excitation1
*Nset, nset=_PickedSet2, internal, generate
*Elset, elset=_PickedSet2, internal, generate
*Nset, nset=_PickedSet3, internal, generate
*Elset, elset=_PickedSet3, internal, generate
** Region: (Section-1:Picked), (Beam Orientation:Picked)
*Elset, elset=_PickedSet2, internal, generate
** Section: Section-1  Profile: Profile-1
*Beam Section, elset=_PickedSet2, material=Material-1, temperature=GRADIENTS, section=CIRC
2.
0.,0.,-1.
*End Instance
**
*Instance, name=Part-2-3, part=Part-2
*Node
*Element, type=B31
*Nset, nset=excitation1
*Nset, nset=_PickedSet2, internal, generate
*Elset, elset=_PickedSet2, internal, generate
*Nset, nset=_PickedSet3, internal, generate
*Elset, elset=_PickedSet3, internal, generate
** Region: (Section-1:Picked), (Beam Orientation:Picked)
*Elset, elset=_PickedSet2, internal, generate
** Section: Section-1  Profile: Profile-1
*Beam Section, elset=_PickedSet2, material=Material-1, temperature=GRADIENTS, section=CIRC
2.
0.,0.,-1.
*End Instance
**
*Instance, name=Part-2-4, part=Part-2
*Node
*Element, type=B33
*Nset, nset=excitation1
*Nset, nset=_PickedSet2, internal, generate
*Elset, elset=_PickedSet2, internal, generate
*Nset, nset=_PickedSet3, internal, generate
*Elset, elset=_PickedSet3, internal, generate
** Region: (Section-1:Picked), (Beam Orientation:Picked)
*Elset, elset=_PickedSet2, internal, generate
** Section: Section-1  Profile: Profile-1
*Beam Section, elset=_PickedSet2, material=Material-1, temperature=GRADIENTS, section=CIRC
2.
0.,0.,-1.
*End Instance
**
*Nset, nset=_PickedSet16, internal, instance=Part-1-2
*Nset, nset=_PickedSet17, internal, instance=Part-1-1
*Nset, nset=_PickedSet20, internal, instance=Part-2-1
*Nset, nset=_PickedSet20, internal, instance=Part-2-2
*Nset, nset=_PickedSet20, internal, instance=Part-2-4
*Nset, nset=_PickedSet20, internal, instance=Part-2-3
*Nset, nset=_PickedSet21, internal, instance=Part-2-1
*Nset, nset=_PickedSet21, internal, instance=Part-2-2
*Nset, nset=_PickedSet21, internal, instance=Part-2-4
*Nset, nset=_PickedSet21, internal, instance=Part-2-3
*Nset, nset=_PickedSet49, internal, instance=Part-1-2
*Elset, elset=_PickedSet49, internal, instance=Part-1-2
*Nset, nset=_PickedSet50, internal, instance=Part-1-2
*Elset, elset=_top_plate_SNEG, internal, instance=Part-1-2, generate
*Surface, type=ELEMENT, name=top_plate
_top_plate_SNEG, SNEG
*Elset, elset=_bottom_plate_SPOS, internal, instance=Part-1-1, generate
*Surface, type=ELEMENT, name=bottom_plate
_bottom_plate_SPOS, SPOS
*Surface, type=NODE, name=_PickedSet20_CNS_, internal
_PickedSet20, 1.
*Surface, type=NODE, name=_PickedSet21_CNS_, internal
_PickedSet21, 1.
** Constraint: Constraint-1
*Tie, name=Constraint-1, adjust=no
_PickedSet20_CNS_, top_plate
** Constraint: Constraint-2
*Tie, name=Constraint-2, adjust=no
_PickedSet21_CNS_, bottom_plate
*End Assembly
**
** MATERIALS
**
*Material, name=Material-1
*Conductivity
100.,
*Density
 7.8e-09,
*Elastic
210000., 0.3
** ----------------------------------------------------------------
**
** STEP: Step-1
**
*Step, name=Step-1, nlgeom=YES
*Coupled Temperature-Displacement, creep=none, deltmx=100.
1., 1., 1e-05, 1.
**
** BOUNDARY CONDITIONS
**
** Name: BC-1 Type: Symmetry/Antisymmetry/Encastre
*Boundary
_PickedSet17, ENCASTRE
** Name: BC-2 Type: Temperature
*Boundary
_PickedSet49, 11, 11, 20.
_PickedSet49, ENCASTRE
**
** LOADS
**
** Name: Load-1   Type: Concentrated heat flux
*Cflux
_PickedSet16, 11, 10000.
** Name: Load-2   Type: Concentrated force
*Cload
_PickedSet50, 3, -10000.
**
** OUTPUT REQUESTS
**
*Restart, write, frequency=0
*End Step
** ----------------------------------------------------------------
**
** STEP: Step-2
**
*Step, name=Step-2, perturbation
*Frequency, eigensolver=ams, normalization=mass
, , 50,35.0 ,18. ,14.5
**
*Output, field, variable=PRESELECT
*End Step
**
** STEP: Step-3
**
*Step, name=Step-3, perturbation
*Steady State Dynamics, frequency scale=LINEAR, interval=range
15., 35., 5,
*Cload
Part-2-1.excitation1, 2, -1.e5
Part-2-2.excitation1, 2, -1.e5
Part-2-3.excitation1, 2, 1.e5
Part-2-4.excitation1, 2, 1.e5
**
** MODAL DAMPING
**
*modal damping, modal=direct, definition=mode numbers
**
** OUTPUT REQUESTS
**
*Output, field
*node output, nset=Part-2-1.excitation1
U,
*node output, nset=Part-2-2.excitation1
U,
*node output, nset=Part-2-3.excitation1
U,
*End Step