*Heading
 Multistep verification test for cpe4r elements using distributions
*Node
*Nset, nset=side1, generate
*Nset, nset=side3, generate
*Nset, nset=ams_out, generate
*Elset, Elset=eall, generate
**------------------------------------------------------------------------------------------
*Material, name=mat1
*Elastic, type=engineering constants
  0.300E+07,  0.400E+07,  0.500E+07,  0.100E+00,  0.200E+00,  0.300E+00,  0.300E+06,  0.400E+06
  0.500E+06,
*Density
  0.750E-03,
**------------------------------------------------------------------------------------------
*Element, type=cpe4r, elset=eall
*Solid Section, material=mat1, elset=eall
1.,
*Distribution, name=distOrient, location=element, type=orientation
*Element Properties
 orientation, distOrient
*Boundary
 side1, 1, 2
**
** --------------------------------------------------
**
*step, name=freq
 frequency analysis
*frequency, eigensolver=ams, residual modes, nset=ams_out
 , ,14000.
side3,2
*output, field
*node output, nset=ams_out
U,
*end step
**
** --------------------------------------------------
**
*step, name=step-3
 SSD mode-based
*steady state dynamics, interval=eigenfrequency
 13000,
*cload
 side3, 2, 100.
*output, field
*node output, nset=ams_out
U,
*end step
**
** --------------------------------------------------
**