*HEADING
 Transfer from Explicit to Standard: Test for B32 element
 - Explicit analysis
 - loading in bending
*NODE, NSET=ALL
*NSET, NSET=LEFT
*NSET, NSET=RIGHT
*NSET, NSET=MID
*ELEMENT, TYPE=B32, ELSET=RECT
*ELEMENT, TYPE=B32, ELSET=BOX
*ELEMENT, TYPE=B32, ELSET=CIRC
*ELEMENT, TYPE=B32, ELSET=HEX
*ELEMENT, TYPE=B32, ELSET=I
*ELEMENT, TYPE=B32, ELSET=L
*ELEMENT, TYPE=B32, ELSET=PIPE
*ELEMENT, TYPE=B32, ELSET=TRAP
*ELSET, ELSET=EALL
*BEAM SECTION,SECTION=RECT,ELSET=RECT,MATERIAL=STEEL,ROTARY=ISOTROPIC
0.1,0.2
*BEAM SECTION,SECTION=BOX,ELSET=BOX,MATERIAL=STEEL,ROTARY=ISOTROPIC
1.0,1.0,0.2,0.2,0.1,0.1
*BEAM SECTION,SECTION=CIRC,ELSET=CIRC,MATERIAL=STEEL,ROTARY=ISOTROPIC
1.0,
*BEAM SECTION,SECTION=HEX,ELSET=HEX,MATERIAL=STEEL,ROTARY=ISOTROPIC
1.0,0.1
*BEAM SECTION,SECTION=I,ELSET=I,MATERIAL=STEEL,ROTARY=ISOTROPIC
0.1,1.0,0.5,0.5,0.1,0.1,0.1
*BEAM SECTION,SECTION=L,ELSET=L,MATERIAL=STEEL,ROTARY=ISOTROPIC
0.5,1.0,0.1,0.1
*BEAM SECTION,SECTION=PIPE,ELSET=PIPE,MATERIAL=STEEL,ROTARY=ISOTROPIC
1.0,0.1
*BEAM SECTION,SECTION=TRAPEZOID,ELSET=TRAP,MATERIAL=STEEL,ROTARY=ISOTROPIC
2.0,1.0,1.0,0.25
*MATERIAL,NAME=STEEL
*ELASTIC
 200.E9, 0.3
*DENSITY
 7850.,
*BOUNDARY
 LEFT, 1,6
 RIGHT, 1,4
*RESTART, WRITE
**
**
*ELSET,ELSET=QA_TEST_ALLELEMS
EALL,
**
*NSET, NSET=QA_TEST_ALLNODES
ALL
**
*STEP
*DYNAMIC, EXPLICIT
,0.1
*BOUNDARY, TYPE=VELOCITY
 RIGHT, 5, 6, 2.0
 MID,   5, 6, 1.0
*FILE OUTPUT, NUMBER INTERVAL=5
*NODE FILE
 U,COORD
*EL FILE
 S
 LE
*OUTPUT,FIELD,NUMBER INTERVAL=1
*ELEMENT OUTPUT
 S,LE,PEEQ
*OUTPUT,HISTORY,FREQUENCY=100
*ELEMENT OUTPUT,ELSET=EALL
 S,LE,PEEQ
*OUTPUT,FIELD,NUMBER INTERVAL=1
*NODE OUTPUT
 U,COORD
*OUTPUT,HISTORY,FREQUENCY=100
*NODE OUTPUT,NSET=ALL
 U,COORD
*END STEP