*HEADING
 Transfer from Explicit to Standard to Explicit
 - Adding/removing elements and verification for initial conditions
 - Test for C3D8R element
*IMPORT, STEP=1, INT=2, UPDATE=YES, STATE=NO
 E1,
*NODE, NSET=N3
*ELEMENT, TYPE=C3D8R, ELSET=E3
*SOLID SECTION, ELSET=E3, MATERIAL=MAT
*MATERIAL, NAME=MAT
*ELASTIC
 200.E9, 0.3
*DENSITY
 1000.,
*BOUNDARY
  1,1,3
111,1,3
  2,2,3
112,2,3
  3,3,3
113,3,3
  4,1,1
  4,3,3
*NSET, NSET=SIDE_2
*INITIAL CONDITIONS, TYPE=STRESS, UNBALANCED STRESS=STEP
 E1, 1.9062E10
*RESTART, WRITE, FREQ=999
*STEP, NLGEOM, INC=50
*STATIC
 0.1, 1.0
*CONTROLS, PARAMETER=FIELD, FIELD=GLOBAL
 1.0E-4,,,1.0
*BOUNDARY
 SIDE_2,1,1,0.2
*EL PRINT,FREQ=999
 S,
 E,
 PEEQ,
*NODE PRINT,FREQ=999
 U,
 COORD,
 RF,
*OUTPUT,HISTORY,VARIABLE=PRESELECT
*OUTPUT,FIELD
*NODE OUTPUT
 U,COORD
*ELEMENT OUTPUT
S,LE,PE,PEEQ
*END STEP