*HEADING
NONSTRUCTURAL MASS VERIFICATION - SINGLE ELEMENT DECKS WITH
"MASS PER VOLUME" UNITS.
*RESTART,WRITE
*********************
*****T2D2************
*NODE,NSET=NALL
*NSET,NSET=ROLLER3
*NSET,NSET=DISP
*NSET,NSET=FIXED
*NSET,NSET=ROLLER2
*ELEMENT,TYPE=T2D2,ELSET=REFER1
*ELEMENT,TYPE=T2D2,ELSET=TEST1
*SOLID SECTION,ELSET=REFER1,MATERIAL=NOSCALE
.5,
*SOLID SECTION,ELSET=TEST1,MATERIAL=SCALE
.5,
*ELSET,ELSET=NOSCALE
REFER1,
*ELSET,ELSET=SCALE
TEST1,
************************
******T3D2***************
*NODE,NSET=NALL
*NSET,NSET=ROLLER3
*NSET,NSET=DISP
*NSET,NSET=FIXED
*NSET,NSET=ROLLER2
*ELEMENT,TYPE=T3D2,ELSET=REFER2
*ELEMENT,TYPE=T3D2,ELSET=TEST2
*SOLID SECTION,ELSET=REFER2,MATERIAL=NOSCALE
.5,
*SOLID SECTION,ELSET=TEST2,MATERIAL=SCALE
.5,
*ELSET,ELSET=NOSCALE
REFER2,
*ELSET,ELSET=SCALE
TEST2,
**************************
******CPE3****************
*NODE,NSET=NALL
*NSET,NSET=ROLLER3
*NSET,NSET=DISP
*NSET,NSET=FIXED
*NSET,NSET=ROLLER2
*ELEMENT,TYPE=CPE3,ELSET=REFER3
*ELEMENT,TYPE=CPE3,ELSET=TEST3
*SOLID SECTION,ELSET=REFER3,MATERIAL=NOSCALE
.5,
*SOLID SECTION,ELSET=TEST3,MATERIAL=SCALE
.5,
*ELSET,ELSET=NOSCALE
REFER3,
*ELSET,ELSET=SCALE
TEST3,
*******************************
********CPE4R******************
*NODE,NSET=NALL
*NSET,NSET=ROLLER3
*NSET,NSET=DISP
*NSET,NSET=FIXED
*NSET,NSET=ROLLER2
*ELEMENT,TYPE=CPE4R,ELSET=REFER4
*REBAR,ELEMENT=CONTINUUM,MATERIAL=NOSCALE,NAME=REB4
*ELEMENT,TYPE=CPE4R,ELSET=TEST4
*REBAR,ELEMENT=CONTINUUM,MATERIAL=NOSCALE,NAME=REB4S
*SOLID SECTION,ELSET=REFER4,MATERIAL=NOSCALE
.5,
*SOLID SECTION,ELSET=TEST4,MATERIAL=SCALE
.5,
*ELSET,ELSET=NOSCALE
REFER4,
*ELSET,ELSET=SCALE
TEST4,
***************************
********CPS3***************
*NODE,NSET=NALL
*NSET,NSET=ROLLER3
*NSET,NSET=DISP
*NSET,NSET=FIXED
*NSET,NSET=ROLLER2
*ELEMENT,TYPE=CPS3,ELSET=REFER5
*ELEMENT,TYPE=CPS3,ELSET=TEST5
*SOLID SECTION,ELSET=REFER5,MATERIAL=NOSCALE
.5,
*SOLID SECTION,ELSET=TEST5,MATERIAL=SCALE
.5,
*ELSET,ELSET=NOSCALE
REFER5,
*ELSET,ELSET=SCALE
TEST5,
*****************************
*********CPS4R***************
*NODE,NSET=NALL
*NSET,NSET=ROLLER3
*NSET,NSET=DISP
*NSET,NSET=FIXED
*NSET,NSET=ROLLER2
*ELEMENT,TYPE=CPS4R,ELSET=REFER6
*REBAR,ELEMENT=CONTINUUM,MATERIAL=NOSCALE,NAME=REB6
*ELEMENT,TYPE=CPS4R,ELSET=TEST6
*REBAR,ELEMENT=CONTINUUM,MATERIAL=NOSCALE,NAME=REB6S
*SOLID SECTION,ELSET=REFER6,MATERIAL=NOSCALE
.5,
*SOLID SECTION,ELSET=TEST6,MATERIAL=SCALE
.5,
*ELSET,ELSET=NOSCALE
REFER6,
*ELSET,ELSET=SCALE
TEST6,
******************************
**********CAX3****************
*NODE,NSET=NALL
*NSET,NSET=ROLLER3
*NSET,NSET=DISP
*NSET,NSET=FIXED
*NSET,NSET=ROLLER2
*ELEMENT,TYPE=CAX3,ELSET=REFER7
*ELEMENT,TYPE=CAX3,ELSET=TEST7
*SOLID SECTION,ELSET=REFER7,MATERIAL=NOSCALE
*SOLID SECTION,ELSET=TEST7,MATERIAL=SCALE
*ELSET,ELSET=NOSCALE
REFER7,
*ELSET,ELSET=SCALE
TEST7,
*********************************
***********CAX4R*****************
*NODE,NSET=NALL
*NSET,NSET=ROLLER3
*NSET,NSET=DISP
*NSET,NSET=FIXED
*NSET,NSET=ROLLER2
*ELEMENT,TYPE=CAX4R,ELSET=REFER8
*REBAR,ELEMENT=CONTINUUM,MATERIAL=NOSCALE,NAME=REB8
*ELEMENT,TYPE=CAX4R,ELSET=TEST8
*REBAR,ELEMENT=CONTINUUM,MATERIAL=NOSCALE,NAME=REB8S
*SOLID SECTION,ELSET=REFER8,MATERIAL=NOSCALE
*SOLID SECTION,ELSET=TEST8,MATERIAL=SCALE
*ELSET,ELSET=NOSCALE
REFER8,
*ELSET,ELSET=SCALE
TEST8,
*******************************
***********C3D4****************
*NODE,NSET=NALL
*NSET,NSET=ROLLER3
*NSET,NSET=DISP
*NSET,NSET=FIXED
*NSET,NSET=ROLLER2
*ELEMENT,TYPE=C3D4,ELSET=REFER9
*ELEMENT,TYPE=C3D4,ELSET=TEST9
*SOLID SECTION,ELSET=REFER9,MATERIAL=NOSCALE
*SOLID SECTION,ELSET=TEST9,MATERIAL=SCALE
*ELSET,ELSET=NOSCALE
REFER9,
*ELSET,ELSET=SCALE
TEST9,
*********************************
**********C3D6*******************
*NODE,NSET=NALL
*NSET,NSET=ROLLER3
*NSET,NSET=DISP
*NSET,NSET=FIXED
*NSET,NSET=ROLLER2
*ELEMENT,TYPE=C3D6,ELSET=REFER10
*ELEMENT,TYPE=C3D6,ELSET=TEST10
*SOLID SECTION,ELSET=REFER10,MATERIAL=NOSCALE
*SOLID SECTION,ELSET=TEST10,MATERIAL=SCALE
*ELSET,ELSET=NOSCALE
REFER10,
*ELSET,ELSET=SCALE
TEST10,
********************************
***********C3D8R****************
*NODE,NSET=NALL
*NSET,NSET=ROLLER3
*NSET,NSET=DISP
*NSET,NSET=FIXED
*NSET,NSET=ROLLER2
*ELEMENT,TYPE=C3D8R,ELSET=REFER11
*REBAR,ELEMENT=CONTINUUM,MATERIAL=NOSCALE,NAME=REB11
*ELEMENT,TYPE=C3D8R,ELSET=TEST11
*REBAR,ELEMENT=CONTINUUM,MATERIAL=NOSCALE,NAME=REB11
*SOLID SECTION,ELSET=REFER11,MATERIAL=NOSCALE
*SOLID SECTION,ELSET=TEST11,MATERIAL=SCALE
*ELSET,ELSET=NOSCALE
REFER11,
*ELSET,ELSET=SCALE
TEST11,
*******************************
***********M3D3****************
*NODE,NSET=NALL
*NSET,NSET=ROLLER3
*NSET,NSET=DISP
*NSET,NSET=FIXED
*NSET,NSET=ROLLER2
*ELEMENT,TYPE=M3D3,ELSET=REFER12
*ELEMENT,TYPE=M3D3,ELSET=TEST12
*MEMBRANE SECTION,NODAL THICKNESS,ELSET=REFER12,MATERIAL=NOSCALE
1.0,
*MEMBRANE SECTION,NODAL THICKNESS,ELSET=TEST12,MATERIAL=SCALE
1.0,
*NODAL THICKNESS
*ELSET,ELSET=NOSCALE
REFER12,
*ELSET,ELSET=SCALE
TEST12,
***********************************
************M3D4R******************
*NODE,NSET=NALL
*NSET,NSET=ROLLER3
*NSET,NSET=DISP
*NSET,NSET=FIXED
*NSET,NSET=ROLLER2
*ELEMENT,TYPE=M3D4R,ELSET=REFER13
*ELEMENT,TYPE=M3D4R,ELSET=TEST13
*MEMBRANE SECTION,ELSET=REFER13,MATERIAL=NOSCALE
.5,
*MEMBRANE SECTION,ELSET=TEST13,MATERIAL=SCALE
.5,
*ELSET,ELSET=NOSCALE
REFER13,
*ELSET,ELSET=SCALE
TEST13,
***********SC8R****************
*NODE,NSET=NALL
*NSET,NSET=ROLLER3
*NSET,NSET=DISP
*NSET,NSET=FIXED
*NSET,NSET=ROLLER2
*ELEMENT,TYPE=SC8R,ELSET=REFER14
*ELEMENT,TYPE=SC8R,ELSET=TEST14
*SHELL SECTION,ELSET=REFER14,MATERIAL=NOSCALE
1.
*SHELL SECTION,ELSET=TEST14,MATERIAL=SCALE
1.
*ELSET,ELSET=NOSCALE
REFER14,
*ELSET,ELSET=SCALE
TEST14,
*******************************
**********SC6R*******************
*NODE,NSET=NALL
*NSET,NSET=ROLLER3
*NSET,NSET=DISP
*NSET,NSET=FIXED
*NSET,NSET=ROLLER2
*ELEMENT,TYPE=SC6R,ELSET=REFER15
*ELEMENT,TYPE=SC6R,ELSET=TEST15
*SHELL SECTION,ELSET=REFER15,MATERIAL=NOSCALE
1.
*SHELL SECTION,ELSET=TEST15,MATERIAL=SCALE
1.
*ELSET,ELSET=NOSCALE
REFER15,
*ELSET,ELSET=SCALE
TEST15,
********************************
******************************
** REMAINDER OF DECK SAME FOR ALL TESTS
******************************
*MATERIAL,NAME=NOSCALE
*ELASTIC
1.E6, .25
*DENSITY
1.E-4,
*MATERIAL,NAME=SCALE
*ELASTIC
1.E6, .25
*DENSITY
1.E-7,
*BOUNDARY
FIXED,1,3
ROLLER2,2,2
ROLLER3,3,3
**************************
*AMPLITUDE,NAME=SMOOTH,DEFINITION=SMOOTH STEP
0.,0.,  .00015, 1.
**************************
*NSET,NSET=QA_TEST_FIXED
FIXED,
*ELSET,ELSET=QA_TEST
SCALE,NOSCALE
*NONSTRUCTURAL MASS, UNITS=MASS PER VOLUME, ELSET=SCALE
**
*STEP
*DYNAMIC,EXPLICIT
,.00015
*BOUNDARY,AMP=SMOOTH
DISP, 1,1, .05
*RESTART,WRITE,NUMBER INTERVAL= 20
*FILE OUTPUT,NUMBER INTERVAL=4,TIMEMARKS=YES
*NODE FILE, NSET=FIXED
RF,
*ENERGY FILE
***OUTPUT,HISTORY,TIME INTERVAL=0.
***NODE OUTPUT,NSET=FIXED
**RF,
***ELEMENT OUTPUT, ELSET=SCALE
**EDT,
***ELEMENT OUTPUT, ELSET=NOSCALE
**EDT,
*OUTPUT, FIELD, NUMBER INTERVAL=4, TIMEMARKS=YES
*NODE OUTPUT, NSET=QA_TEST_FIXED
RF,
*ELEMENT OUTPUT, ELSET=QA_TEST
EDT,
*OUTPUT,FIELD,VARIABLE=PRESELECT
*OUTPUT,HISTORY,VARIABLE=PRESELECT,TIMEINT=3.75E-05
*END STEP