*HEADING
 TEST OF ELEMENT MATRIX OUTPUT -
 ELEMENT: S4R5
*NODE
*ELEMENT,TYPE=S4R5,ELSET=EALL
*SHELL SECTION,MATERIAL=A1,ELSET=EALL
 1.0,
*MATERIAL,NAME=A1
*ELASTIC,TYPE=ISOTROPIC
 30.0E6,0.3
*BOUNDARY
 1,1,5
 2,2,3
 3,3
 4,3
*STEP,PERTURB
*STATIC
*CLOAD
 2,1, 1500.0
 3,1, -500.0
 3,2,  500.0
 4,1,-1500.0
 4,2, 1500.0
*ELEMENT MATRIX OUTPUT,ELSET=EALL,STIFF=Y
*ELEMENT MATRIX OUTPUT,ELSET=EALL,STIFF=Y,OUTPUT=USER
*ENERGY FILE
*OUTPUT,HISTORY,FREQUENCY=1
*ENERGY OUTPUT,VARIABLE=PRESELECT
*NODE FILE
 U,
*OUTPUT,FIELD
*NODE OUTPUT
U,
*NODE PRINT
 U,
*EL PRINT,FREQ=0
*EL FILE,FREQ=0
*OUTPUT,FIELD,FREQ=0
*ELEMENT OUTPUT
*END STEP