*HEADING
 LARGE STRAIN VISCO - UNIAXIAL TENSION - CPE4R
*NODE
*ELEMENT,TYPE=CPE4R,ELSET=ONE
*SOLID SECTION,ELSET=ONE,MATERIAL=SIMPLE
1.,
*MATERIAL,NAME=SIMPLE
*HYPERELASTIC,N=1,MODULI=INSTANTANEOUS
1.5E6,0.5E6,1.E-7
*VISCOELASTIC,TIME=PRONY
0.25,,0.5
0.25,,2.0
*DENSITY
1.0,
*BOUNDARY
1,1,2
2,2,2
4,1,1
**
*RESTART,TIMEMARKS=NO,WRITE,NUMBER=10
**
**
*ELSET,ELSET=QA_TEST_ALLELEMS
ONE,
**
*STEP
*DYNAMIC,EXPLICIT
,10.
*BOUNDARY,TYPE=VELOCITY
 3,1,1,1.
 2,1,1,1.
**
*FILE OUTPUT,TIMEMARKS=YES,NUM=3
*EL FILE
 S,
 LE,
**
*OUTPUT, FIELD, TIMEMARKS=YES, NUMBER INTERVAL=3
*ELEMENT OUTPUT, ELSET=QA_TEST_ALLELEMS
 S,
 LE,
*OUTPUT,FIELD,VARIABLE=PRESELECT
*OUTPUT,HISTORY,VARIABLE=PRESELECT,TIMEINT=3.33333
***OUTPUT,HISTORY,VARIABLE=PRESELECT
*END STEP