*Heading
** Job name: TEMP Model name: Model-1
**
** PARTS
**
*Part, name=PART-1
*End Part
**
** ASSEMBLY
**
*Assembly, name=Assembly
**
*Instance, name=PART-1-1, part=PART-1
*Node
*Element, type=C3D8R
*Element, type=M3D4R
*Element, type=S4R
*Element, type=S4
*Elset, elset=SOLID1
*Elset, elset=MEMB1
*Elset, elset=SHELL1
*Elset, elset=SHELL2
** Region: (Section-1-SOLID1:SOLID1)
*Elset, elset=_I1, internal
** Section: Section-1-SOLID1
*Solid Section, elset=_I1, material=SOLID1
1.,
** Region: (Section-2-MEMB1:MEMB1)
*Elset, elset=_I2, internal
** Section: Section-2-MEMB1
*Membrane Section, elset=_I2, material=MEMB1
1.,
*REBAR LAYER
REB6,0.5,1.0,0,REBAR,30,1
** Region: (Section-3-SHELL1:SHELL1)
*Elset, elset=_I3, internal
** Section: Section-3-SHELL1
*Shell Section, elset=_I3, material=SHELL1
1., 5
*REBAR LAYER
REB11,0.5,1.0,0,REBAR,30,1
** Region: (Section-4-SHELL2:SHELL2)
*Elset, elset=_I4, internal
** Section: Section-4-SHELL2
*Shell Section, elset=_I4, material=SHELL2
1., 5
*REBAR LAYER
REB12,0.5,1.0,0,REBA1,30,1
*ORIENTATION,NAME=REBAR1,DEFINITION=OFFSET TO NODES
*ELEMENT,TYPE=SFM3D4R,ELSET=SFM3D4R-1
*SURFACE SECTION,ELSET=SFM3D4R-1
*REBAR LAYER,ORIENTATION=REBAR1
REB1,0.500000,1.000000,0.000000,REBAR,60.000000,1
*EMBEDDED ELEMENT
*End Instance
*Nset, nset=BACK, instance=PART-1-1
*Nset, nset=BOT, instance=PART-1-1
*Nset, nset=LEFT, instance=PART-1-1
*Nset, nset=NALL, instance=PART-1-1
*Nset, nset=NALLS, instance=PART-1-1, generate
*Nset, nset=RIGHT, instance=PART-1-1
*End Assembly
**
** MATERIALS
**
*Material, name=MEMB1
*Elastic
10000., 0.25
*Material, name=REBA1
*Elastic
20000.,0.
*User Output Variables
*Material, name=REBAR
*Elastic
20000.,0.
*User Output Variables
*Material, name=SHELL1
*Elastic
10000., 0.25
*Material, name=SHELL2
*Elastic
10000., 0.25
*Material, name=SOLID1
*Elastic
10000., 0.25
** ----------------------------------------------------------------
**
** STEP: Step-1
**
*Step, name=Step-1, nlgeom
*Static
0.2, 1., 1e-05, 1.
**
** BOUNDARY CONDITIONS
**
** Name: Disp-BC-1 Type: Displacement/Rotation
*Boundary
NALL, 3, 3
** Name: Disp-BC-2 Type: Displacement/Rotation
*Boundary
LEFT, 1, 1
** Name: Disp-BC-3 Type: Displacement/Rotation
*Boundary
BACK, 3, 3
** Name: Disp-BC-4 Type: Displacement/Rotation
*Boundary
BOT, 2, 2
** Name: Disp-BC-5 Type: Displacement/Rotation
*Boundary
RIGHT, 1, 1, 1.
**
** OUTPUT REQUESTS
**
*Restart, write, frequency=99
**
** FIELD OUTPUT: F-Output-1
**
*Output, field, variable=PRESELECT
**
** HISTORY OUTPUT: H-Output-1
**
*Output, history, variable=PRESELECT
*El Print, freq=999999
*Node Print, freq=999999
*EL FILE, F=1
S,
E,
*EL FILE, REBAR, F=1
S,
E,
UVARM,
*NODE FILE, F=1
U,
RF,
*End Step