*HEADING
 TEST OF USER OUTPUT VARIABLES - UNIAXIAL TENSION TEST, CPE8RP ---
 KEYWORD-PARAMETER COMBINATIONS TESTED:  RATIOS,DEPENDENCIES  AND
 SORPTION,LAW=LOG
*NODE,NSET=ALLN
*NGEN,NSET=BOT
*NGEN,NSET=TOP
*NFILL,NSET=ALLN
BOT,TOP,20,5
*NSET,NSET=LHS,GEN
*NSET,NSET=RHS,GEN
*ELEMENT,TYPE=CPE8RP,ELSET=BLOCK
*ELSET,ELSET=OUTE
*ORIENTATION,NAME=RECT
*SOLID SECTION,ELSET=BLOCK,MATERIAL=SEP2,ORIENT=RECT
.02,
*MATERIAL,NAME=SEP2
*ELASTIC
10000.,0.
*POROUS BULK MODULI
*PERMEABILITY
3.7E-4,
*SWELLING
*RATIOS,DEP=1
*SORPTION,LAW=LOG,TYPE=ABSORPTION
*SORPTION,LAW=LOG,TYPE=EXSORPTION
*SORPTION,TYPE=SCANNING
*USER OUTPUT VARIABLES
*INITIAL CONDITIONS,TYPE=SATURATION
ALLN,.05
*NSET,NSET=PORN
*INITIAL CONDITIONS,TYPE=PORE
PORN,-10000.
*INITIAL CONDITIONS,TYPE=RATIO
ALLN,5.
*BOUNDARY
BOT,2
ALLN,1
*RESTART,WRITE
*AMPLITUDE,NAME=A1
0.0,-10000.,1.0E-7,-1000.
*INITIAL CONDITIONS,TYPE=FIELD,VARIABLE=1
ALLN,1.0
*INITIAL CONDITIONS,TYPE=TEMPERATURE
ALLN,1.0
*STEP
*SOILS,CONSOLIDATION,UTOL=100.
*BOUNDARY
*BOUNDARY,AMP=A1
1,8,8,1
3,8,8,1
11,8,8,2
13,8,8,2
*CONTROLS,ANAL=DISC
*EL PRINT,FREQ=1,SUMMARY=NO
SAT,
*EL PRINT,FREQ=1,SUMMARY=NO
POR,
*EL PRINT,FREQ=1,SUMMARY=NO
FV,
*EL PRINT,FREQ=1,SUMMARY=NO
FLVEL,
*EL FILE,ELSET=OUTE
UVARM,SAT,POR,VOIDR
E,
FLVEL,
*END STEP