*HEADING
*RESTART, WRITE
*PREPRINT,ECHO=YES,HISTORY=NO,MODEL=NO
*NODE
*NGEN, NSET=FACE3
*NGEN, NSET=FACE5
*NSET, NSET=FACE1
*NSET, NSET=FACE2
*NSET, NSET=FACE4
*NSET, NSET=FACE6
*NSET,NSET=CORNERS1
*NSET,NSET=CORNERS2
*NSET,NSET=CORNERS3
*NSET,NSET=CORNERS4
*NSET,NSET=CORNERS5
*NSET,NSET=CORNERS6
*NSET,NSET=NALL, GENERATE
*NSET,NSET=CORNERS
*NSET, NSET=NOUT
*ELEMENT, TYPE=C3D20P, ELSET=EALL
*SOLID SECTION,MATERIAL=A1, ELSET=EALL
*MATERIAL,NAME=A1
*ELASTIC
 1.E8,
*PERMEABILITY
 1.E-5,
*DENSITY
 1.7321,
*INITIAL CONDITIONS,TYPE=RATIO
NALL,1.
*STEP
*SOILS,CONSOLIDATION
*EL PRINT, FREQ=0
*NODE PRINT, NSET=NOUT
RF,
*NODE FILE, NSET=NOUT
 RF,
*BOUNDARY, OP=NEW
 NALL, 1,3
 CORNERS, 8
*DLOAD, OP=NEW
 1, BX, 100.
 1, BY, 100.
 1, BZ, 100.
*END STEP
*STEP
*SOILS,CONSOLIDATION
*DLOAD, OP=NEW
 1, GRAV, 100.,1,1,1
*END STEP
*STEP
*SOILS,CONSOLIDATION
*DLOAD, OP=NEW
 1, P1, 100.
 1, P2, 100.
*END STEP
*STEP
*SOILS,CONSOLIDATION
*DLOAD, OP=NEW
 1, P3, 100.
 1, P5, 100.
*END STEP