*Heading
** Job name: new-axi Model name: Model-1
*Preprint, echo=NO, model=NO, history=NO, contact=NO
** ----------------------------------------------------------------
**
** PART INSTANCE: TIRE-1
**
*Node,Nset=Ntire
*Element, type=CGAX4
*Element, type=CGAX3
*Node
*Nset, nset=TIRE-1-RefPt_
*Elset, elset=SOLIDELEM, generate
** Region: (TIRE_SECTION:Picked)
*Elset, elset=TIRE-1__PickedSet9
** Section: TIRE_SECTION
*Solid Section, elset=TIRE-1__PickedSet9, material=RUBBER
1.,
** Region: (TREAD_SECTION:Picked)
*Elset, elset=TIRE-1__PickedSet8
** Section: TREAD_SECTION
*Solid Section, elset=TIRE-1__PickedSet8, material=TREAD
1.,
** ----------------------------------------------------------------
**
** PART INSTANCE: BELT1-1
**
*Node,Nset=Ntire
*Element, type=SFMGAX1
*Elset, elset=BELT1-1_BELT1, generate
** Region: (BELT1_SECTION:BELT1)
** Section: BELT1_SECTION
*Surface Section, elset=BELT1-1_BELT1
*Rebar Layer
BELT1, 2.11868e-07, 0.00116, , BELT, 70., 1
** ----------------------------------------------------------------
**
** PART INSTANCE: BELT2-1
**
*Node,Nset=Ntire
*Element, type=SFMGAX1
*Elset, elset=BELT2-1_BELT2, generate
** Region: (BELT2_SECTION:BELT2)
** Section: BELT2_SECTION
*Surface Section, elset=BELT2-1_BELT2
*Rebar Layer
BELT2, 2.11868e-07, 0.00116, , BELT, 110., 1
** ----------------------------------------------------------------
**
** PART INSTANCE: CARCASS-1
**
*Node,Nset=Ntire
*Element, type=SFMGAX1
*Elset, elset=CARCASS-1_CARCASS, generate
** Region: (CARCASS_SECTION:CARCASS)
** Section: CARCASS_SECTION
*Surface Section, elset=CARCASS-1_CARCASS
*Rebar Layer
CARCASS, 4.20835e-07, 0.001, , CARCASS, 0., 1
**
**
*Nset, nset=NADAPT
*Nset, nset=NADAPT_LAGR
*Nset, nset=RIM
*Nset, nset=RIMNOD
*Nset, nset=SYM
*Elset, elset=TREAD
*Elset, elset=MIDDLE_TREAD, generate
*Elset, elset=SIDE_TREAD, generate
*Elset, elset=_INSIDE_S2
*Elset, elset=_INSIDE_S4
*Surface, type=ELEMENT, name=INSIDE
_INSIDE_S2, S2
_INSIDE_S4, S4
*Elset, elset=_TREADSURF_S2
*Elset, elset=_TREADSURF_S4
*Elset, elset=_TREADSURF_S1
*Elset, elset=_TREADSURF_S3, generate
*Surface, type=ELEMENT, name=TREADSURF
_TREADSURF_S2, S2
_TREADSURF_S4, S4
_TREADSURF_S1, S1
_TREADSURF_S3, S3
** Constraint: BELT1-EMBED
*Embedded Element
BELT1-1_BELT1
** Constraint: BELT2_EMBED
*Embedded Element
BELT2-1_BELT2
** Constraint: CARCASS_EMBED
*Embedded Element, absolute exterior tolerance=0.005
CARCASS-1_CARCASS
** Constraint: RIGID_RIM
*Rigid Body, ref node=RIM, tie nset=RIMNOD
**
** SECTION CONTROLS
**
** MATERIALS
**
*Material, name=BELT
*Density
5900.,
***Elastic
** 1.722e+11, 0.3
*Hyperelastic, Marlow
*Uniaxial Test Data
*Material, name=CARCASS
*Density
1500.,
***Elastic
** 9.87e+09, 0.3
*Hyperelastic, Marlow
*Uniaxial Test Data
*Material, name=RUBBER
*Density
1100.,
*Hyperelastic, moduli=LONG TERM
 1e+06,0.,2e-8
*Viscoelastic, time=PRONY
 0.3,  0., 0.1
*Material, name=TREAD
*Density
1100.,
*Elastic
** 1e+08, 0.48
6e+6,0.49
*Viscoelastic, time=PRONY
 0.3, 0., 0.1
** ----------------------------------------------------------------
**
** STEP: INFLATION
**
*Step, name=INFLATION, nlgeom=YES
*Static,LONGTERM
0.25, 1., 1e-05, 1.
**
** BOUNDARY CONDITIONS
**
** Name: RIM_BC Type: Symmetry/Antisymmetry/Encastre
*Boundary
RIM, ENCASTRE
** Name: SYM_BC Type: Displacement/Rotation
*Boundary
SYM, 2, 2
SYM, 5, 5
**
** LOADS
**
** Name: INFL_PRES   Type: Pressure
*Dsload
INSIDE, P, 200000.
**
** OUTPUT REQUESTS
**
*Restart, write, overlay
**
** FIELD OUTPUT: F-Output-1
**
*Output, field
*Node Output
CF, RF, U
*Element Output
LE, S
*Element Output, rebar
LE, RBANG, RBFOR, S
*Contact Output
CDISP, CSTRESS
**
** HISTORY OUTPUT: H-Output-1
**
*Output, history
*Node Output, nset=RIM
RF1, RF2, RF3, RM1, RM2, RM3
*End Step