*Heading
** traction loading for shell elements
*Preprint, echo=NO, model=NO, history=NO, contact=NO
**
** PARTS
**
*Part, name=Part-1
*End Part
*Part, name=Part-2
*End Part
*Part, name=Part-3
*End Part
*Part, name=Part-4
*End Part
**
** ASSEMBLY
**
*Assembly, name=Assembly
**
*Instance, name=Part-1-1, part=Part-1
*Node
*Element, type=S4R
*Node
*Nset, nset=Part-1-1-RefPt_, internal
** Region: (Section-1:Picked)
*Elset, elset=_PickedSet3, internal, generate
** Section: Section-1
*Shell Section, elset=_PickedSet3, material=Material-1
0.2, 5
*End Instance
**
*Instance, name=Part-2-1, part=Part-2
*Node
*Element, type=M3D4R
*Node
*Nset, nset=Part-2-1-RefPt_, internal
** Region: (Section-2:Picked)
*Elset, elset=_PickedSet3, internal, generate
** Section: Section-2
*Membrane Section, elset=_PickedSet3, material=Material-1
0.2,
*End Instance
**
*Instance, name=Part-3-1, part=Part-3
*Node
*Element, type=SFM3D4R
*Node
*Nset, nset=Part-3-1-RefPt_, internal
** Region: (Section-3:Picked)
*Elset, elset=_PickedSet3, internal, generate
** Section: Section-3
*Surface Section, elset=_PickedSet3
*Rebar Layer
rebar, 0.01, 0.1, , Material-1, 0., 1
rebar-2, 0.01, 0.1, , Material-1, 90., 1
*End Instance
**
*Instance, name=Part-4-1, part=Part-4
*Node
*Element, type=R3D4
*Node
*Nset, nset=Part-4-1-RefPt_, internal
*Elset, elset=Part-4-1, generate
*End Instance
**
*Instance, name=Part-1-1-1-2, part=Part-1
*Node
*Element, type=S3R
*Node
*Nset, nset=Part-1-1-1-2-RefPt_, internal
** Region: (Section-1:Picked)
*Elset, elset=_PickedSet3, internal, generate
** Section: Section-1
*Shell Section, elset=_PickedSet3, material=Material-1
0.2, 5
*End Instance
**
*Instance, name=Part-2-1-1-2, part=Part-2
*Node
*Element, type=M3D3
*Node
*Nset, nset=Part-2-1-1-2-RefPt_, internal
** Region: (Section-2:Picked)
*Elset, elset=_PickedSet3, internal, generate
** Section: Section-2
*Membrane Section, elset=_PickedSet3, material=Material-1
0.2,
*End Instance
**
*Instance, name=Part-3-1-1-2, part=Part-3
*Node
*Element, type=SFM3D3
*Node
*Nset, nset=Part-3-1-1-2-RefPt_, internal
** Region: (Section-3:Picked)
*Elset, elset=_PickedSet3, internal, generate
** Section: Section-3
*Surface Section, elset=_PickedSet3
*Rebar Layer
rebar, 0.01, 0.1, , Material-1, 0., 1
rebar-2, 0.01, 0.1, , Material-1, 90., 1
*End Instance
**
*Instance, name=Part-4-1-1-2, part=Part-4
*Node
*Element, type=R3D3
*Node
*Nset, nset=Part-4-1-1-2-RefPt_, internal
*Elset, elset=Part-4-1-1-2, generate
*End Instance
*Nset, nset=_PickedSet19, internal, instance=Part-1-1
*Nset, nset=_PickedSet21, internal, instance=Part-1-1-1-2
*Nset, nset=_PickedSet23, internal, instance=Part-2-1
*Nset, nset=_PickedSet25, internal, instance=Part-2-1-1-2
*Nset, nset=_PickedSet27, internal, instance=Part-3-1
*Nset, nset=_PickedSet29, internal, instance=Part-3-1-1-2
*Nset, nset=boun, instance=Part-1-1
*Nset, nset=boun, instance=Part-2-1
*Nset, nset=boun, instance=Part-4-1
*Nset, nset=boun, instance=Part-4-1-1-2
*Nset, nset=boun, instance=Part-2-1-1-2
*Nset, nset=boun, instance=Part-3-1
*Nset, nset=boun, instance=Part-1-1-1-2
*Nset, nset=boun, instance=Part-3-1-1-2
*Elset, elset=_Surf-1_SPOS, internal, instance=Part-1-1, generate
*Elset, elset=_Surf-1_SPOS, internal, instance=Part-1-1-1-2, generate
*Surface, type=ELEMENT, name=Surf-1
_Surf-1_SPOS, SPOS
*Elset, elset=_Surf-2_SPOS, internal, instance=Part-2-1, generate
*Elset, elset=_Surf-2_SPOS, internal, instance=Part-2-1-1-2, generate
*Surface, type=ELEMENT, name=Surf-2
_Surf-2_SPOS, SPOS
*Elset, elset=_Surf-3_SPOS, internal, instance=Part-3-1, generate
*Elset, elset=_Surf-3_SPOS, internal, instance=Part-3-1-1-2, generate
*Surface, type=ELEMENT, name=Surf-3
_Surf-3_SPOS, SPOS
*Elset, elset=_Surf-4_SPOS, internal, instance=Part-4-1, generate
*Elset, elset=_Surf-4_SPOS, internal, instance=Part-4-1-1-2, generate
*Surface, type=ELEMENT, name=Surf-4
_Surf-4_SPOS, SPOS
*Elset, elset=__PickedSurf59_SPOS, internal, instance=Part-3-1, generate
*Surface, type=ELEMENT, name=_PickedSurf59, internal
__PickedSurf59_SPOS, SPOS
*Elset, elset=__PickedSurf60_SPOS, internal, instance=Part-3-1-1-2, generate
*Surface, type=ELEMENT, name=_PickedSurf60, internal
__PickedSurf60_SPOS, SPOS
*Elset, elset=__PickedSurf61_SPOS, internal, instance=Part-1-1, generate
*Surface, type=ELEMENT, name=_PickedSurf61, internal
__PickedSurf61_SPOS, SPOS
*Elset, elset=__PickedSurf62_SPOS, internal, instance=Part-1-1-1-2, generate
*Surface, type=ELEMENT, name=_PickedSurf62, internal
__PickedSurf62_SPOS, SPOS
*Elset, elset=__PickedSurf63_SPOS, internal, instance=Part-2-1, generate
*Surface, type=ELEMENT, name=_PickedSurf63, internal
__PickedSurf63_SPOS, SPOS
*Elset, elset=__PickedSurf64_SPOS, internal, instance=Part-2-1-1-2, generate
*Surface, type=ELEMENT, name=_PickedSurf64, internal
__PickedSurf64_SPOS, SPOS
*Rigid Body, ref node=Part-4-1.Part-4-1-RefPt_, elset=Part-4-1.Part-4-1
*Rigid Body, ref node=Part-4-1-1-2.Part-4-1-1-2-RefPt_, elset=Part-4-1-1-2.Part-4-1-1-2
** Constraint: Constraint-1
*Coupling, constraint name=Constraint-1, ref node=_PickedSet19, surface=_PickedSurf61
*Kinematic
1, 1
2, 2
3, 3
** Constraint: Constraint-2
*Coupling, constraint name=Constraint-2, ref node=_PickedSet21, surface=_PickedSurf62
*Kinematic
1, 1
2, 2
3, 3
** Constraint: Constraint-3
*Coupling, constraint name=Constraint-3, ref node=_PickedSet23, surface=_PickedSurf63
*Kinematic
1, 1
2, 2
3, 3
** Constraint: Constraint-4
*Coupling, constraint name=Constraint-4, ref node=_PickedSet25, surface=_PickedSurf64
*Kinematic
1, 1
2, 2
3, 3
** Constraint: Constraint-5
*Coupling, constraint name=Constraint-5, ref node=_PickedSet27, surface=_PickedSurf59
*Kinematic
1, 1
2, 2
3, 3
** Constraint: Constraint-6
*Coupling, constraint name=Constraint-6, ref node=_PickedSet29, surface=_PickedSurf60
*Kinematic
1, 1
2, 2
3, 3
*End Assembly
*Amplitude, name=Amp-1
0., 0., 1., 1.
**
** MATERIALS
**
*Material, name=Material-1
*Density
 0.0001,
*Elastic
1000., 0.3
** ----------------------------------------------------------------
**
** STEP: Step-1
**
*Step, name=Step-1
*Dynamic, Explicit
, 1.
*Bulk Viscosity
**
** BOUNDARY CONDITIONS
**
** Name: BC-1 Type: Displacement/Rotation
*Boundary
boun, 1, 1
boun, 2, 2
boun, 3, 3
boun, 4, 4
boun, 5, 5
boun, 6, 6
**
** LOADS
**
** Name: Load-1   Type: Surface traction
*Dsload, amplitude=Amp-1
Surf-1, TRVEC, 1.732, 0.57735, 0.57735, 0.57735
** Name: Load-2   Type: Surface traction
*Dsload, amplitude=Amp-1
Surf-2, TRSHR, 1.414, 0.57735, 0.57735, 0.57735
** Name: Load-3   Type: Surface traction
*Dsload, amplitude=Amp-1
Surf-3, TRVEC, 1.732, 0.57735, 0.57735, 0.57735
** Name: Load-4   Type: Surface traction
*Dsload, amplitude=Amp-1
Surf-4, TRSHR, 1.414, 0.57735, 0.57735, 0.57735
**
** OUTPUT REQUESTS
**
*Restart, write, number interval=1, time marks=NO
**
** FIELD OUTPUT: F-Output-1
**
*Output, field
*Node Output
RF, U
*Output, history, frequency=0
*End Step