*Heading
** traction loading for continuum shell
*Preprint, echo=NO, model=NO, history=NO, contact=NO
**
** PARTS
**
*Part, name=Part-1
*End Part
**
** ASSEMBLY
**
*Assembly, name=Assembly
**
*Instance, name=Part-1-1, part=Part-1
*Node
*Element, type=SC6R
*Node
*Nset, nset=Part-1-1-RefPt_, internal
** Region: (Section-1:Picked)
*Elset, elset=_PickedSet3, internal, generate
** Section: Section-1
*Shell Section, elset=_PickedSet3, material=Material-1
1., 5
*End Instance
**
*Instance, name=Part-1-2, part=Part-1
*Node
*Element, type=SC8R
*Node
*Nset, nset=Part-1-2-RefPt_, internal
** Region: (Section-1:Picked)
*Elset, elset=_PickedSet3, internal, generate
** Section: Section-1
*Shell Section, elset=_PickedSet3, material=Material-1
1., 5
*End Instance
*Nset, nset=_PickedSet6, internal, instance=Part-1-2
*Nset, nset=_PickedSet7, internal, instance=Part-1-2
*Nset, nset=_PickedSet8, internal, instance=Part-1-1
*Nset, nset=_PickedSet9, internal, instance=Part-1-1
*Nset, nset=_PickedSet21, internal, instance=Part-1-1
*Nset, nset=_PickedSet21, internal, instance=Part-1-2
*Elset, elset=_Surf-1_S2, internal, instance=Part-1-1, generate
*Elset, elset=_Surf-1_S2, internal, instance=Part-1-2, generate
*Surface, type=ELEMENT, name=Surf-1
_Surf-1_S2, S2
*Elset, elset=_Surf-2_S4, internal, instance=Part-1-1
*Elset, elset=_Surf-2_S6, internal, instance=Part-1-2, generate
*Surface, type=ELEMENT, name=Surf-2
_Surf-2_S4, S4
_Surf-2_S6, S6
*Surface, type=NODE, name=_PickedSet6_CNS_, internal
_PickedSet6, 1.
*Surface, type=NODE, name=_PickedSet8_CNS_, internal
_PickedSet8, 1.
** Constraint: Constraint-1
*Coupling, constraint name=Constraint-1, ref node=_PickedSet7, surface=_PickedSet6_CNS_
*Distributing, weighting method=UNIFORM
** Constraint: Constraint-2
*Coupling, constraint name=Constraint-2, ref node=_PickedSet9, surface=_PickedSet8_CNS_
*Distributing, weighting method=UNIFORM
*End Assembly
*Amplitude, name=Amp-1
0., 0., 1., 1.
**
** MATERIALS
**
*Material, name=Material-1
*Density
 0.0001,
*Elastic
1000., 0.3
** ----------------------------------------------------------------
**
** STEP: Step-1
**
*Step, name=Step-1
*Dynamic, Explicit
, 1.
*Bulk Viscosity
**
** BOUNDARY CONDITIONS
**
** Name: BC-1 Type: Displacement/Rotation
*Boundary
_PickedSet21, 1, 1
_PickedSet21, 2, 2
_PickedSet21, 3, 3
_PickedSet21, 4, 4
_PickedSet21, 5, 5
_PickedSet21, 6, 6
**
** LOADS
**
** Name: Load-1   Type: Surface traction
*Dsload, amplitude=Amp-1
Surf-1, TRSHR, 1., 0., 1., 0.
** Name: Load-2   Type: Surface traction
*Dsload, amplitude=Amp-1
Surf-2, TRSHR, 1., 0., 0., 1.
**
** OUTPUT REQUESTS
**
** FIELD OUTPUT: F-Output-1
**
*Output, field
*Node Output
RF, U
*Output, history, frequency=0
*End Step