*Heading
** traction loading for axisymmetric element.
*Preprint, echo=NO, model=NO, history=NO, contact=NO
**
** PARTS
**
*Part, name=Part-1
*End Part
**
** ASSEMBLY
**
*Assembly, name=Assembly
**
*Instance, name=Part-1-1, part=Part-1
*Node
*Element, type=CAX6M
** Region: (Section-1:Picked)
*Elset, elset=_PickedSet2, internal, generate
** Section: Section-1
*Solid Section, elset=_PickedSet2, material=Material-1
1.,
*End Instance
**
*Instance, name=Part-1-1-1-2, part=Part-1
*Node
*Element, type=CAX4R
** Region: (Section-1:Picked)
*Elset, elset=_PickedSet2, internal, generate
** Section: Section-1
*Solid Section, elset=_PickedSet2, material=Material-1
1.,
*End Instance
**
*Instance, name=Part-1-1-1-3, part=Part-1
*Node
*Element, type=CAX3
** Region: (Section-1:Picked)
*Elset, elset=_PickedSet2, internal, generate
** Section: Section-1
*Solid Section, elset=_PickedSet2, material=Material-1
1.,
*End Instance
*Nset, nset=boun, instance=Part-1-1
*Nset, nset=boun, instance=Part-1-1-1-2, generate
*Nset, nset=boun, instance=Part-1-1-1-3
*Elset, elset=boun, instance=Part-1-1
*Elset, elset=boun, instance=Part-1-1-1-2
*Elset, elset=boun, instance=Part-1-1-1-3
*Elset, elset=_Surf-1_S2, internal, instance=Part-1-1-1-3
*Surface, type=ELEMENT, name=Surf-1
_Surf-1_S2, S2
*Elset, elset=_Surf-2_S3, internal, instance=Part-1-1-1-2
*Surface, type=ELEMENT, name=Surf-2
_Surf-2_S3, S3
*Elset, elset=_Surf-3_S2, internal, instance=Part-1-1
*Surface, type=ELEMENT, name=Surf-3
_Surf-3_S2, S2
*End Assembly
*Amplitude, name=Amp-1
0., 0., 1., 1.
**
** MATERIALS
**
*Material, name=Material-1
*Density
 0.0001,
*Elastic
1000., 0.3
** ----------------------------------------------------------------
**
** STEP: Step-1
**
*Step, name=Step-1
*Dynamic, Explicit
, 1.
*Bulk Viscosity
**
** BOUNDARY CONDITIONS
**
** Name: BC-1 Type: Displacement/Rotation
*Boundary
boun, 2, 2
**
** LOADS
**
** Name: Load-1   Type: Surface traction
*Dsload, amplitude=Amp-1
Surf-1, TRVEC, 1., 0., -1., 0.
** Name: Load-2   Type: Surface traction
*Dsload, amplitude=Amp-1
Surf-2, TRVEC, 1.414, 0.707107, 0.707107, 0.
** Name: Load-3   Type: Surface traction
*Dsload, amplitude=Amp-1
Surf-3, TRSHR, 1., 0.707107, 0.707107, 0.
**
** OUTPUT REQUESTS
**
**
** FIELD OUTPUT: F-Output-1
**
*Output, field, number=6
*Node output
u,rf
*End Step