*Heading
** traction loading for 2d elements
*Preprint, echo=NO, model=NO, history=NO, contact=NO
**
** PARTS
**
*Part, name=Part-1
*End Part
**
** ASSEMBLY
**
*Assembly, name=Assembly
**
*Instance, name=Part-1-1, part=Part-1
*Node
*Element, type=CPS3
*Node
*Nset, nset=Part-1-1-RefPt_, internal
** Region: (Section-1:Picked)
*Elset, elset=_PickedSet2, internal, generate
** Section: Section-1
*Solid Section, elset=_PickedSet2, material=Material-1
1.,
*End Instance
**
*Instance, name=Part-1-1-1-2, part=Part-1
*Node
*Element, type=CPE3
*Node
*Nset, nset=Part-1-1-1-2-RefPt_, internal
** Region: (Section-1:Picked)
*Elset, elset=_PickedSet2, internal, generate
** Section: Section-1
*Solid Section, elset=_PickedSet2, material=Material-1
1.,
*End Instance
**
*Instance, name=Part-1-1-2-1, part=Part-1
*Node
*Element, type=CPS4R
*Node
*Nset, nset=Part-1-1-2-1-RefPt_, internal
** Region: (Section-1:Picked)
*Elset, elset=_PickedSet2, internal, generate
** Section: Section-1
*Solid Section, elset=_PickedSet2, material=Material-1
1.,
*End Instance
**
*Instance, name=Part-1-1-2-2, part=Part-1
*Node
*Element, type=CPE4R
*Node
*Nset, nset=Part-1-1-2-2-RefPt_, internal
** Region: (Section-1:Picked)
*Elset, elset=_PickedSet2, internal, generate
** Section: Section-1
*Solid Section, elset=_PickedSet2, material=Material-1
1.,
*End Instance
**
*Instance, name=Part-1-1-3-1, part=Part-1
*Node
*Element, type=CPS6M
*Node
*Nset, nset=Part-1-1-3-1-RefPt_, internal
** Region: (Section-1:Picked)
*Elset, elset=_PickedSet2, internal
** Section: Section-1
*Solid Section, elset=_PickedSet2, material=Material-1
1.,
*End Instance
**
*Instance, name=Part-1-1-3-2, part=Part-1
*Node
*Element, type=CPE6M
*Node
*Nset, nset=Part-1-1-3-2-RefPt_, internal
** Region: (Section-1:Picked)
*Elset, elset=_PickedSet2, internal
** Section: Section-1
*Solid Section, elset=_PickedSet2, material=Material-1
1.,
*End Instance
*Nset, nset=_PickedSet14, internal, instance=Part-1-1, generate
*Nset, nset=_PickedSet15, internal, instance=Part-1-1
*Nset, nset=_PickedSet16, internal, instance=Part-1-1-2-1
*Nset, nset=_PickedSet17, internal, instance=Part-1-1-2-1
*Nset, nset=_PickedSet18, internal, instance=Part-1-1-3-1, generate
*Nset, nset=_PickedSet19, internal, instance=Part-1-1-3-1
*Nset, nset=_PickedSet20, internal, instance=Part-1-1-1-2, generate
*Nset, nset=_PickedSet21, internal, instance=Part-1-1-1-2
*Nset, nset=_PickedSet22, internal, instance=Part-1-1-2-2
*Nset, nset=_PickedSet23, internal, instance=Part-1-1-2-2
*Nset, nset=_PickedSet24, internal, instance=Part-1-1-3-2, generate
*Nset, nset=_PickedSet25, internal, instance=Part-1-1-3-2
*Nset, nset=boun, instance=Part-1-1
*Nset, nset=boun, instance=Part-1-1-1-2
*Nset, nset=boun, instance=Part-1-1-2-2
*Nset, nset=boun, instance=Part-1-1-3-2
*Nset, nset=boun, instance=Part-1-1-2-1
*Nset, nset=boun, instance=Part-1-1-3-1
*Elset, elset=_SurfX1_S2, internal, instance=Part-1-1
*Surface, type=ELEMENT, name=SurfX1
_SurfX1_S2, S2
*Elset, elset=_SurfX2_S2, internal, instance=Part-1-1-1-2
*Surface, type=ELEMENT, name=SurfX2
_SurfX2_S2, S2
*Elset, elset=_SurfX3_S2, internal, instance=Part-1-1-2-1
*Surface, type=ELEMENT, name=SurfX3
_SurfX3_S2, S2
*Elset, elset=_SurfX4_S2, internal, instance=Part-1-1-2-2
*Surface, type=ELEMENT, name=SurfX4
_SurfX4_S2, S2
*Elset, elset=_SurfX5_S2, internal, instance=Part-1-1-3-1
*Surface, type=ELEMENT, name=SurfX5
_SurfX5_S2, S2
*Elset, elset=_SurfX6_S2, internal, instance=Part-1-1-3-2
*Surface, type=ELEMENT, name=SurfX6
_SurfX6_S2, S2
*Surface, type=NODE, name=_PickedSet14_CNS_, internal
_PickedSet14, 1.
*Surface, type=NODE, name=_PickedSet16_CNS_, internal
_PickedSet16, 1.
*Surface, type=NODE, name=_PickedSet18_CNS_, internal
_PickedSet18, 1.
*Surface, type=NODE, name=_PickedSet20_CNS_, internal
_PickedSet20, 1.
*Surface, type=NODE, name=_PickedSet22_CNS_, internal
_PickedSet22, 1.
*Surface, type=NODE, name=_PickedSet24_CNS_, internal
_PickedSet24, 1.
** Constraint: Constraint-1
*Coupling, constraint name=Constraint-1, ref node=_PickedSet15, surface=_PickedSet14_CNS_
*Kinematic
1, 1
2, 2
** Constraint: Constraint-2
*Coupling, constraint name=Constraint-2, ref node=_PickedSet17, surface=_PickedSet16_CNS_
*Kinematic
1, 1
2, 2
** Constraint: Constraint-3
*Coupling, constraint name=Constraint-3, ref node=_PickedSet19, surface=_PickedSet18_CNS_
*Kinematic
1, 1
2, 2
** Constraint: Constraint-4
*Coupling, constraint name=Constraint-4, ref node=_PickedSet21, surface=_PickedSet20_CNS_
*Kinematic
1, 1
2, 2
** Constraint: Constraint-5
*Coupling, constraint name=Constraint-5, ref node=_PickedSet23, surface=_PickedSet22_CNS_
*Kinematic
1, 1
2, 2
** Constraint: Constraint-6
*Coupling, constraint name=Constraint-6, ref node=_PickedSet25, surface=_PickedSet24_CNS_
*Kinematic
1, 1
2, 2
*End Assembly
*Amplitude, name=Amp-1
0., 0., 1., 1.
**
** MATERIALS
**
*Material, name=Material-1
*Density
 0.0001,
*Elastic
1000., 0.3
** ----------------------------------------------------------------
**
** STEP: Step-1
**
*Step, name=Step-1
*Dynamic, Explicit
, 1.
*Bulk Viscosity
**
** BOUNDARY CONDITIONS
**
** Name: BC-1 Type: Displacement/Rotation
*Boundary
boun, 1, 1
boun, 2, 2
boun, 6, 6
**
** LOADS
**
** Name: Load-1   Type: Surface traction
*Dsload, amplitude=Amp-1
SurfX1, TRVEC, 1.414, 0.707107, 0.707107, 0.
** Name: Load-2   Type: Surface traction
*Dsload, amplitude=Amp-1
SurfX2, TRVEC, 1., 1., 0., 0.
** Name: Load-3   Type: Surface traction
*Dsload, amplitude=Amp-1
SurfX3, TRSHR, 1., 0.707107, 0.707107, 0.
** Name: Load-4   Type: Surface traction
*Dsload, amplitude=Amp-1
SurfX4, TRSHR, 1., -0.707107, -0.707107, 0.
** Name: Load-5   Type: Surface traction
*Dsload, amplitude=Amp-1
SurfX5, TRVEC, 1.414, -0.707107, -0.707107, 0.
** Name: Load-6   Type: Surface traction
*Dsload, amplitude=Amp-1
SurfX6, TRVEC, 1.414, 0.707107, 0.707107, 0.
**
** OUTPUT REQUESTS
**
*Restart, write, number interval=1, time marks=NO
**
** FIELD OUTPUT: F-Output-1
**
*Output, field
*Node output
U,RF
**
*End Step