*HEADING
THERMAL STRESS IN A CYLINDRICAL SHELL [C3D8RT]
**
** See ch. 1.3.16 of ABAQUS/Verification Manual
**
*NODE,NSET=ALLN,SYSTEM=C
*ELEMENT,TYPE=C3D8RT,ELSET=ALLE
*ELSET,ELSET=QA_TEST
ALLE
*SOLID SECTION,ELSET=ALLE,MATERIAL=STEEL,ORIE=OR1
*ORIENTATION,SYS=CYL,NAME=OR1
*MATERIAL,NAME=STEEL
*DENSITY
7800.,
*CONDUCTIVITY
52.,
*SPECIFIC HEAT
586.,
*ELASTIC
200.E9, 0.3
*EXPANSION
1.2E-5,
*NSET,NSET=ROTATE
*NSET,NSET=Z1
*NSET,NSET=Z2
*NSET,NSET=RIN
*NSET,NSET=ROUT
*TRANSFORM,NSET=ROTATE,TYPE=C
*AMPLITUDE,NAME=RAMP
0.0,0.0,0.4,1.0
*EQUATION
** RADIAL
RIN,1,1.0,ROUT,1,-1.0
**AXIAL
RIN,3,1.0,ROUT,3,-1.0
**RADIAL MID NODES
**AXIAL MID NODES
*STEP
STRESS ANALYSIS USING TEMP DISTRIBUTION
*DYNAMIC TEMPERATURE-DISPLACEMENT, EXPLICIT
*FIXED MASS SCALING, ELSET=ALLE, FACTOR=1.E4
*MONITOR, NODE=1, DOF=11
*BOUNDARY,AMP=RAMP
** THERMAL B.C.
 RIN, 11,11,200.0
 ROUT,11,11,100.0
*BOUNDARY,TYPE=VELOCITY
**DISPLACEMENT B.C.
ALLN,2
***************************
*FILE OUTPUT, NUM=1
*EL FILE, ELSET=ALLE
Temp,S
***************************
*OUTPUT,FIELD,NUMBER INTERVAL=1
*ELEMENT OUTPUT, ELSET=QA_TEST
Temp,S
**************************
***OUTPUT,HISTORY,TIME INTERVAL=4.E-2
***ELEMENT OUTPUT, ELSET=ALLE
**Temp,S,
***********
*OUTPUT,HISTORY,TIME INTERVAL=0.4
*ENERGY OUTPUT,VAR=ALL
************************
*ENDSTEP