*HEADING
  HEATING OF AUTOMOTIVE ELECTRICAL FUSE
  STEADY STATE ANALYSIS
  Units: mm; deg. C; Joule; sec; kg; Ampere
*RESTART,WRITE,FREQUENCY=100
**
*NODE, INPUT=thermelectautofuse_node.inp
*NSET, NSET=NLHS
*NSET, NSET=NRHS
*NSET, NSET=NOUTP
*ELEMENT, TYPE=DC3D8E, ELSET=EALL,
INPUT=thermelectautofuse_element.inp
*ELEMENT, TYPE=DC3D6E, ELSET=EALL
*ELSET,ELSET=ELEMENT,GENERATE
*ELSET,ELSET=BLADES,GENERATE
*SOLID SECTION, ELSET=EALL, MATERIAL=ZINC
*SURFACE,NAME=SIDE
88,S5
87,S5
*MATERIAL, NAME=ZINC
*CONDUCTIVITY
 0.1121,  20.0
 0.1103, 100.0
*ELECTRICAL CONDUCTIVITY
*JOULE HEAT FRACTION
*FILM PROPERTY,NAME=H1
*FILM PROPERTY,NAME=H2
*STEP,INC=100
  STEP 1: JOULE HEATING ANALYSIS
*COUPLED THERMAL-ELECTRICAL,STEADY STATE
*BOUNDARY
 NRHS, 9, , 0.0
 NLHS, 11,, 29.4
 NRHS, 11,, 30.2
*CECURRENT
 NLHS, 9, 3.0
*FILM
 ELEMENT, F1, 23.3, H1
 ELEMENT, F2, 23.3, H1
 BLADES,  F1, 23.3, H2
 BLADES,  F2, 23.3, H2
*ENERGY PRINT,FREQUENCY=100
***ENERGY FILE,FREQUENCY=100
*EL PRINT,ELSET=ELEMENT,FREQUENCY=100
 JENER, HFLM, ECDM, EPGM
***EL FILE,ELSET=ELEMENT,FREQUENCY=100
** HFL, ECD, EPG
*NODE PRINT,NSET=NOUTP,FREQUENCY=100
 NT,EPOT
***NODE FILE,NSET=NOUTP,FREQUENCY=100
** NT,EPOT
*SECTION PRINT,NAME=SID88,SURFACE=SIDE
SOAREA,SOH,SOE
***SECTION FILE, NAME=SID88,SURFACE=SIDE
**SOAREA,SOH,SOE
*OUTPUT, FIELD
*ELEMENT OUTPUT
HFL,ECD,EPG
*NODE OUTPUT
NT,EPOT
*OUTPUT,HISTORY
*ENERGY OUTPUT, VARIABLE=PRESELECT
*END STEP
*STEP,INC=100
  STEP 2: COOL DOWN ANALYSIS
*HEAT TRANSFER,STEADY STATE
*END STEP