*HEADING
 Transfer from Standard to Explicit : Test for S3R element
 - Explicit analysis
 - unloading of shear
*IMPORT,STEP=1,UPDATE=YES,STATE=NO
 SHELL,
*IMPORT NSET
 ALL, SIDE
*MATERIAL,NAME=STEEL
*ELASTIC
 200.E9, 0.3
*DENSITY
 1000.,
*BOUNDARY
 ALL, 3,3
 1, 1,2
 2, 1,2
 3, 2,2
 4, 2,2
**
**
*ELSET, ELSET=QA_TEST_ALLELEMS
shell,
**
*NSET, NSET=QA_TEST_ALLNODES
all,side
**
*STEP
*DYNAMIC,EXPLICIT
 , 0.01,
*FILE OUTPUT,TIMEMARKS=YES,NUM=4
*EL FILE
 STH,
*NODE FILE
 U,
*OUTPUT, FIELD, TIMEMARKS=YES, NUMBER INTERVAL=4
*ELEMENT OUTPUT, ELSET=QA_TEST_ALLELEMS
 STH,
*NODE OUTPUT, NSET=QA_TEST_ALLNODES
 U,
*OUTPUT,FIELD,VARIABLE=PRESELECT
*OUTPUT,HISTORY,VARIABLE=PRESELECT,TIMEINT=0.0025
***OUTPUT,HISTORY,VARIABLE=PRESELECT
*END STEP