*HEADING
 Transfer from Standard to Explicit : Test for CPS3 element
 - Explicit analysis
 - unloading of shear
*IMPORT,STEP=1,UPDATE=NO,STATE=NO
 SHELL,
*IMPORT NSET
 ALL, SIDE
*MATERIAL,NAME=STEEL
*ELASTIC
 200.E9, 0.3
*DENSITY
 1000.,
*BOUNDARY
 1, 1,2
 2, 1,2
 3, 2,2
 4, 2,2
**
**
*NSET, NSET=QA_TEST_ALLNODES
ALL, SIDE
**
*STEP
*DYNAMIC,EXPLICIT
,0.005
*BULK VISCOSITY
*FILE OUTPUT,TIMEMARKS=YES,NUM=1
*NODE FILE
 U,
*OUTPUT, FIELD, TIMEMARKS=YES, NUMBER INTERVAL=1
*NODE OUTPUT, NSET=QA_TEST_ALLNODES
 U,
*OUTPUT,FIELD,VARIABLE=PRESELECT
*OUTPUT,HISTORY,VARIABLE=PRESELECT,TIMEINT=0.005
***OUTPUT,HISTORY,VARIABLE=PRESELECT
*END STEP