*HEADING
Submodel: Cantilevered plate [S4R]
*PREPRINT,ECHO=YES,HISTORY=NO,MODEL=NO
*NODE
*NGEN,NSET=NL
*NGEN,NSET=NR
*NSET,NSET=QA_TEST
NR,
*NFILL,NSET=NALL
NL,NR,4,7
*ELEMENT,TYPE=S4R,ELSET=EALL
*ELGEN,ELSET=EALL
*SHELL SECTION,ELSET=EALL,MATERIAL=MAT1, SECTION=GAUSS
0.001, 6
*MATERIAL,NAME=MAT1
*ELASTIC
1.E6,0.3
*DENSITY
10.,
**********************
*AMPLITUDE,NAME=RAMP_UP,DEFINITION=SMOOTH STEP
0,0,1,1
*SUBMODEL,ABS=0.01
NL,
***********************
*STEP
*DYNAMIC,EXPLICIT
,1.0
*DLOAD,AMP=RAMP_UP
EALL,P,1.e-2
*BOUNDARY,SUBMODEL,STEP=1
NL,1,6
***********
*FILE OUTPUT,NUM=1
*NODE FILE
U,
***********
*OUTPUT, FIELD, NUMBER INTERVAL=1
*NODE OUTPUT,NSET=QA_TEST
U
************
*OUTPUT, FIELD, NUMBER INTERVAL=4
*NODE OUTPUT
U
*ELEMENT OUTPUT
S,LE
*OUTPUT, HISTORY, TIME INTERVAL=0.05
*NODE OUTPUT,NSET=NALL
U,
*ENERGY OUTPUT,VAR=PRESELECT
*END STEP
***********