*HEADING
PATCH TEST FOR AXISYMMETRIC ELEMENTS  [CAX4RT]
*PREPRINT,ECHO=YES,HISTORY=NO,MODEL=NO
*NODE,NSET=NALL
*NGEN,NSET=NALL
*ELEMENT,TYPE=CAX4RT,ELSET=EALL
*NSET, NSET=QA_TEST
NALL
*ELSET, ELSET=QA_TEST
EALL,
*ELSET,ELSET=EL3
*SOLID SECTION,MATERIAL=A1, ELSET=EALL
*MATERIAL,NAME=A1
*ELASTIC,TYPE=ISOTROPIC
1.E6,.25
*EXPANSION
0.0,
*CONDUCTIVITY
4.85E-4,
*DENSITY
100.0,
*SPECIFIC HEAT
.116,
*AMPLITUDE, NAME=RAMP
0,0,1., 1.0
*AMPLITUDE, NAME=RAMPDOWN
0,1.0,0., 1.0
**
**
*STEP
*DYNAMIC TEMPERATURE-DISPLACEMENT, EXPLICIT
*BOUNDARY,TYPE=VELOCITY
10,1,,1.E-3
10,2,,1.E-3
20,1,,1.24E-3
20,2,,1.24E-3
30,1,,1.24E-3
30,2,,1.36E-3
40,1,,1.E-3
40,2,,1.12E-3
*DLOAD, AMP=RAMP
EALL,BZNU
*FILE OUTPUT, NUM=1
*EL FILE
 S,
 LE,
*NODE FILE
 U,
********************************
*OUTPUT,FIELD,NUMBER INTERVAL=1
*NODE OUTPUT, NSET=QA_TEST
U,
*ELEMENT OUTPUT, ELSET=QA_TEST
LE,
*****************************
*END STEP
**
**
*STEP
*DYNAMIC TEMPERATURE-DISPLACEMENT, EXPLICIT
*BOUNDARY,TYPE=VELOCITY
10,1,,-1.E-3
10,2,,-1.E-3
20,1,,-1.24E-3
20,2,,-1.24E-3
30,1,,-1.24E-3
30,2,,-1.36E-3
40,1,,-1.E-3
40,2,,-1.12E-3
*DLOAD, AMP=RAMPDOWN
EALL,BZNU
*END STEP
**
**
*STEP
*DYNAMIC TEMPERATURE-DISPLACEMENT, EXPLICIT
*BOUNDARY, OP=NEW, TYPE=VELOCITY
10,1,,1.E-2
10,2,,0.
20,1,,1.24E-2
20,2,,0.
30,1,,1.24E-2
30,2,,0.12E-2
40,1,,1.E-2
40,2,,0.12E-2
*END STEP
**
**
*STEP
*DYNAMIC TEMPERATURE-DISPLACEMENT, EXPLICIT
*BOUNDARY,TYPE=VELOCITY
10,1,,1.01E-3
10,2,,1.01E-3
20,1,,1.2524E-3
20,2,,1.2524E-3
30,1,,1.2524E-3
30,2,,1.3736E-3
40,1,,1.01E-3
40,2,,1.1312E-3
*DLOAD
EALL,BZNU
*END STEP