*HEADING
SPHERICAL CAP
*RESTART,WRITE,NUMBER INTERVAL =2,TIMEMARKS=NO
*PREPRINT,ECHO=NO,MODEL=YES,HISTORY=NO
*NODE, NSET=QA_TEST_ALLNODES
*NSET, NSET=N1,GENERATE
*NSET, NSET=N2
*NSET, NSET=N3
*NSET,NSET=OUT91
*ELEMENT,TYPE=S4RS, ELSET=ALL
*MATERIAL,NAME=A1
*ELASTIC,TYPE=ISO
1.05e+7,0.3
*DENSITY
 2.45e-4,
*PLASTIC
2.4e+4,0.0
4.5e+4,0.1
*SECTION CONTROLS, NAME=HG, HOURGLASS=STIFFNESS
*SHELL SECTION,MATERIAL=A1,ELSET=ALL,SECTION INTEGRATION=GAUSS,CONTROLS=HG
 0.41,5,
**
*NSET, NSET=QA_TEST_ALLNODES
QA_TEST_ALLNODES, N1, N2, N3
OUT91,
**
*STEP
*DYNAMIC,EXPLICIT, FIXED TIME INC
,1.e-3
*BOUNDARY
N1, ENCASTRE
N2,YSYMM
N3, XSYMM
*DLOAD
ALL,P,-600.0
*FILE OUTPUT,TIMEMARKS=YES, NUMBER INTERVAL=1
*NODE FILE
U,
*OUTPUT,HISTORY,TIME INTERVAL=1.e-6
*ENERGY OUTPUT
ALLKE,ALLIE,ALLSE,ALLAE,ALLVD,ALLCD,ALLPD,ALLFD,ALLWK,ETOTAL
*NODE OUTPUT,NSET=OUT91
U,
*OUTPUT, FIELD, TIMEMARKS=YES, NUMBER INTERVAL=1
*NODE OUTPUT, NSET=QA_TEST_ALLNODES
U,
*OUTPUT,HISTORY,VARIABLE=PRESELECT,TIMEINT=0.001
***OUTPUT,HISTORY,VARIABLE=PRESELECT
*END STEP