*HEADING
*restart,write,freq=999
*preprint,model=yes,history=yes
*NODE,NSET=NALL
*NSET, GEN, UNSORT, NSET=INNER
*NSET, GEN, UNSORT, NSET=BOT
*NSET, GEN, UNSORT, NSET=LEFT
*NSET, GEN, UNSORT, NSET=RIGHT
*ELEMENT,TYPE=C3D8,ELSET=DISK
*ELEMENT,TYPE=C3D8,ELSET=PAD
*NSET,NSET=PADTOP
*NSET,NSET=PADBOUN
*ELSET, GEN, ELSET=ONE
*ELSET, GEN, ELSET=ELOAD
*ELSET,ELSET=PRINT
*SOLID SECTION,ELSET= DISK,MATERIA= STEEL,ORIENTA= ORAXI
*MATERIAL,NAME= STEEL
*ELASTIC
70000,0.33
*plastic,hardening=kinematic
62,0
595.5,0.25
*EXPANSION
11.E-6,
*DENSITY
7800.,
*SOLID SECTION,ELSET=PAD,MATERIAL=STEEL2,ORIENTA= ORAXI
*MATERIAL, NAME=STEEL2
*ELASTIC
7.0E3,0.33
*plastic,hardening=kinematic
62,0
595.5,0.25
*EXPANSION
11.E-6,
*DENSITY
7800.,
*ORIENTATION,SYS=CYLI,NAME= ORAXI
*SURFACE,NAME=DISK
ELOAD,S5
*SURFACE,NAME=PAD
PAD,S1
*CONTACT PAIR, SMALL SLIDING, INTERACTION=DISK_PAD
DISK,PAD
*SURFACE INTERACTION,NAME=DISK_PAD
*FRICTION
 0
*SURFACE,NAME=syma4
210,s6
211,s6
212,s6
*SURFACE,NAME=symb4
213,s4
214,s4
215,s4
*BOUNDARY
bot,1,3
padboun,1,1
padboun,2,2
*SURFACE,NAME=syma
1,s2
2,s2
3,s2
4,s2
5,s2
6,s2
7,s2
8,s2
9,s2
*SURFACE,NAME=symb
201,s1
202,s1
203,s1
204,s1
205,s1
206,s1
207,s1
208,s1
209,s1
*SURFACE,name=syma1
1,s2
2,s2
3,s2
4,s2
*SURFACE,name=syma2
5,s2
6,s2
7,s2
*SURFACE,name=syma3
8,s2
9,s2
*SURFACE,name=symb1
201,s1
202,s1
203,s1
204,s1
*SURFACE,name=symb2
205,s1
206,s1
207,s1
*SURFACE,name=symb3
208,s1
209,s1
*TRANSFORM,NSET=NALL,TYPE=C
*STEP,nlgeom
*STATIC
0.2,1
*boundary
padtop,3,3,-1.0E-3
*PRINT, CONTACT=YES
*EL PRINT, FREQUENCY=1
s,
e
*output,field
*node output,nset=padtop
u
*element output,elset=eload
s,
e,
*END STEP