*Heading
 self contact rubber gasket
**
** PARTS
**
*Part, name=Part-1
*End Part
*Part, name=Part-2
*End Part
**
** ASSEMBLY
**
*Assembly, name=Assembly
**
*Instance, name=Part-1-1, part=Part-1
*Node
*Element, type=C3D8H
*Element, type=C3D8
** Region: (Section-2:Picked)
*Elset, elset=_PickedSet5, internal, generate
** Section: Section-2
*Solid Section, elset=_PickedSet5, material=Material-2
1.,
** Region: (Section-1:Picked)
*Elset, elset=_PickedSet4, internal, generate
** Section: Section-1
*Solid Section, elset=_PickedSet4, material=plastic
1.,
*End Instance
**
*Instance, name=Part-2-1, part=Part-2
*Node
*Nset, nset=Part-2-1-RefPt_, internal
*Surface, type=CYLINDER, name=Surf-1
START,           8.,         2.06
 LINE,          -1.,         2.06
*Rigid Body, ref node=Part-2-1-RefPt_, analytical surface=Surf-1
*End Instance
*Nset, nset=_PickedSet8, internal, instance=Part-2-1
*Nset, nset=_PickedSet9, internal, instance=Part-1-1
*Elset, elset=_PickedSet9, internal, instance=Part-1-1, generate
*Nset, nset=_PickedSet10, internal, instance=Part-1-1
*Elset, elset=_PickedSet10, internal, instance=Part-1-1, generate
*Nset, nset=_PickedSet11, internal, instance=Part-1-1
*Elset, elset=_PickedSet11, internal, instance=Part-1-1
*Nset, nset=_PickedSet12, internal, instance=Part-1-1
*Elset, elset=_PickedSet12, internal, instance=Part-1-1
*Elset, elset=_Surf-2_S4, internal, instance=Part-1-1
*Elset, elset=_Surf-2_S6, internal, instance=Part-1-1
*Elset, elset=_Surf-2_S5, internal, instance=Part-1-1
*Elset, elset=_Surf-2_S3, internal, instance=Part-1-1
*Surface, type=ELEMENT, name=Surf-2
_Surf-2_S4, S4
_Surf-2_S6, S6
_Surf-2_S5, S5
_Surf-2_S3, S3
*End Assembly
**
** MATERIALS
**
*Material, name=Material-2
*Hyperelastic
 0.35, 0.25,   0.
*Material, name=plastic
*Elastic
8000., 0.4
**
** INTERACTION PROPERTIES
**
*Surface Interaction, name=IntProp-1
*Surface Behavior, augmented Lagrange
*Friction
 0.05,
*Surface Interaction, name=IntProp-2
*Surface Behavior, augmented Lagrange
*Friction
1.0,
**
** INTERACTIONS
**
** Interaction: Int-1
*Contact Pair, interaction=IntProp-1
Surf-2, Part-2-1.Surf-1
** Interaction: Int-2
*Contact Pair, interaction=IntProp-2
Surf-2,
** ----------------------------------------------------------------
**
** STEP: Step-1
**
*Step, name=Step-1, nlgeom=YES, unsymm=yes
*Static
0.1, 1.
**
** BOUNDARY CONDITIONS
**
** Name: BC-1 Type: Displacement/Rotation
*Boundary
_PickedSet8, 1, 1
_PickedSet8, 2, 2, -0.61
_PickedSet8, 3, 3
_PickedSet8, 4, 4
_PickedSet8, 5, 5
_PickedSet8, 6, 6
** Name: BC-2 Type: Displacement/Rotation
*Boundary
_PickedSet9, 3, 3
** Name: BC-3 Type: Displacement/Rotation
*Boundary
_PickedSet10, 3, 3
** Name: BC-4 Type: Displacement/Rotation
*Boundary
_PickedSet11, 1, 1
** Name: BC-5 Type: Displacement/Rotation
*Boundary
_PickedSet12, 2, 2
**
** OUTPUT REQUESTS
**
**
** FIELD OUTPUT: F-Output-1
**
*Output, field, variable=PRESELECT, freq=10
**
** HISTORY OUTPUT: H-Output-1
**
*Output, history, variable=PRESELECT, freq=10
*End Step