*HEADING
Thick plate rolling: 3-Dimensional, ABAQUS/Explicit
*RESTART,WRITE,NUM=4
*NODE, NSET=BAR
**
**
*ELEMENT, TYPE=C3D10M, ELSET=METAL
*SOLID SECTION,ELSET=METAL,MAT=C15,CONTROL=B
1.,
*SECTION CONTROLS,NAME=B
*MATERIAL,NAME=C15
*ELASTIC
1.5E11,.3
*PLASTIC
168.72E06,0
219.33E06,0.1
272.02E06,0.2
308.53E06,0.3
337.37E06,0.4
361.58E06,0.5
382.65E06,0.6
401.42E06,0.7
*DENSITY
21654225.0,
*NODE
** Reference node
*INITIAL CONDITIONS,TYPE=VELOCITY
BAR,1,1.0367
**
***************** Step 1
*SURFACE, NAME=ROLLER, TYPE=REVOL
START, 0.170,0.03
LINE,  0.170,0.0
*SURFACE,TYPE=ELEMENT, NAME=SURF1
       1, S1
       2, S1
      21, S1
      22, S1
      41, S1
      42, S1
      61, S1
      61, S2
      62, S1
      64, S2
      67, S4
      68, S4
      71, S2
      74, S2
      77, S4
      78, S4
      81, S1
      82, S1
     101, S1
     102, S1
** ... 348 like lines cut
*RIGID BODY, REF NODE=30000, ANALYTICAL SURFACE =ROLLER
*STEP
*DYNAMIC,EXPLICIT
,0.089286
** Roller, Radius = .170 m
*BOUNDARY
       9, 2,,          0.
       9, 3,,          0.
      18, 2,,          0.
      27, 2,,          0.
      36, 2,,          0.
      45, 2,,          0.
      54, 2,,          0.
      63, 2,,          0.
**
** ZSYMM
**
*BOUNDARY
       1, 3,,          0.
       2, 3,,          0.
       3, 3,,          0.
       4, 3,,          0.
       5, 3,,          0.
       6, 3,,          0.
       7, 3,,          0.
       8, 3,,          0.
**
*BOUNDARY
       1, 4,,          0.
       1, 5,,          0.
       2, 4,,          0.
       2, 5,,          0.
       3, 4,,          0.
       3, 5,,          0.
       4, 4,,          0.
       4, 5,,          0.
*BOUNDARY
30000,1,5
*BOUNDARY,TYPE=VELOCITY
**30000,6,6,330.0
30000,6,6,6.2832
*SURFACE INTERACTION,NAME=FRICT
*FRICTION
 0.3,
*CONTACT PAIR,INTERACTION=FRICT
SURF1,ROLLER
**
*NSET, NSET=NOUT
*ELSET, ELSET=ELOUT
**
*FILE OUTPUT,TIMEMARKS=YES,NUM=1
*EL FILE, ELSET=QA_TEST
PEEQ,
*NODE FILE, NSET=QA_TEST
U,
*ENERGY FILE
*****
*ELSET, ELSET=QA_TEST
ELOUT,
*NSET, NSET=QA_TEST
NOUT,
*OUTPUT, FIELD, TIME MARKS=YES, NUMBER INTERVAL=1
*ELEMENT OUTPUT, ELSET=QA_TEST
PEEQ,
*NODE OUTPUT, NSET=QA_TEST
U,
*OUTPUT, HIST, FREQ=9999
*ENERGY OUTPUT, VAR=PRESELECT
****
*OUTPUT, FIELD, TIME MARKS=YES, NUMBER INTERVAL=1
*ELEMENT OUTPUT
PEEQ,
*NODE OUTPUT
U,
******
*END STEP