*HEADING
: SUBMODEL FROM PGX38SRS_STD [SFM3D8]
*NODE
*NGEN,NSET=LEFT
*NGEN,NSET=RIGHT
*NFILL,NSET=ALL
LEFT,RIGHT,8,100
*ELEMENT,TYPE=SFM3D8, ELSET=EALL
*ELGEN,ELSET=EALL
*ELSET,ELSET=ONE
*SURFACE SECTION,ELSET=EALL
*REBAR LAYER
REB,0.3,0.5,0,MAT2,0.0,1
REB_2,0.3,0.5,0,MAT2,90.0,1
REB_3,0.3,0.5,0,MAT2,45.0,1
*MATERIAL,NAME=MAT2
*ELASTIC,TYPE=ISOTROPIC
1.E6,.25
*NSET,NSET=DRIV,GEN
*NSET,NSET=PART,GEN
*SUBMODEL,EXTER=0.005
DRIV,
*STEP,PERT
*STATIC
*BOUNDARY
801,1,,.24E-3
801,2,,.12E-3
805,1,,.27E-3
805,2,,.18E-3
809,1,,.3E-3
809,2,,.24E-3
*BOUNDARY,SUBMODEL,STEP=1
DRIV,1,3
*NODE FILE,NSET=PART
 U,RF
*NODE PRINT,NSET=PART
 U,
*EL PRINT,ELSET=EALL,REBAR
S
E
RBANG
*EL FILE,ELSET=EALL,REBAR
S
E
RBANG
*OUTPUT,FIELD
*ELEMENT OUTPUT,ELSET=EALL,REBAR
S
E
RBANG
*END STEP
*STEP,NLGEOM
*STATIC
0.5,1.0
*CLOAD,FOLLOWER
801, 1, 0.2
809, 1, 0.2
809, 2, 0.4
805, 1, 0.8
*BOUNDARY
801,2
*BOUNDARY,SUBMODEL,STEP=2
DRIV,1,3
*NODE PRINT,SUMMARY=NO,NSET=PART
U,
*NODE FILE,NSET=PART
U,RF
*EL PRINT,ELSET=EALL,REBAR
S
E
RBANG
*EL FILE,ELSET=EALL,REBAR
S
E
RBANG
*OUTPUT,FIELD
*ELEMENT OUTPUT,ELSET=EALL,REBAR
S
E
RBANG
*END STEP