*HEADING
 SUBSTRUCTURE GENERATION FILE FOR psupreb2.inp
**
*NODE,NSET=ALL
*ELEMENT,TYPE=SAX1,ELSET=SHELL
*SHELL SECTION,MATERIAL=ELMAT, ELSET=SHELL
2.,3
*REBAR LAYER,ANGULAR SPACING
REBAR,1.0,46.245,0,RBMAT,0,1
*MATERIAL,NAME=ELMAT
*ELASTIC
1.,
*MATERIAL,NAME=RBMAT
*ELASTIC
30.E6,
**
**
*STEP
*SUBSTRUCTURE GENERATE,TYPE=Z1,OVERWRITE
*RETAINED NODAL DOFS
*SUBSTRUCTURE LOAD CASE,NAME=CLOAD
*CLOAD
3,1,20000.
*END STEP