*HEADING
: SUBMODEL FROM PGM38SRS [M3D8]
*NODE
*NGEN,NSET=LEFT
*NGEN,NSET=RIGHT
*NFILL,NSET=ALL
LEFT,RIGHT,8,100
*ELEMENT,TYPE=M3D8, ELSET=EALL
*ELGEN,ELSET=EALL
*ELSET,ELSET=ONE
*MEMBRANE SECTION,MATERIAL=A1, ELSET=EALL
.001,
*MATERIAL,NAME=A1
*ELASTIC,TYPE=ISOTROPIC
1.E6,.25
*NSET,NSET=DRIV,GEN
*NSET,NSET=PART,GEN
*SUBMODEL,EXTER=0.005
DRIV,
*STEP,PERT
*STATIC
*BOUNDARY
801,1,,.24E-3
801,2,,.12E-3
805,1,,.27E-3
805,2,,.18E-3
809,1,,.3E-3
809,2,,.24E-3
*BOUNDARY,SUBMODEL,STEP=1
DRIV,1,3
*ENERGY PRINT
COORD
*NODE FILE,NSET=PART
 U,RF
*NODE PRINT,NSET=PART
 U,
*ENERGY FILE
*ENERGY PRINT
*EL PRINT,ELSET=ONE
 S,
*EL FILE,ELSET=ONE
 S,
*END STEP
*STEP,NLGEOM
*STATIC
0.5,1.0
*CLOAD,FOLLOWER
801, 1, 0.2
809, 1, 0.2
809, 2, 0.4
805, 1, 0.8
*BOUNDARY
801,2
*BOUNDARY,SUBMODEL,STEP=2
DRIV,1,3
*ENERGY PRINT
*ENERGY FILE
*EL PRINT,SUMMARY=NO,ELSET=ONE
S,
*EL FILE,ELSET=ONE
S,
*NODE PRINT,SUMMARY=NO,NSET=PART
U,
*NODE FILE,NSET=PART
U,RF
*END STEP