*HEADING
: SUBMODEL FROM PGM33SFS   [M3D8]
*NODE
*NGEN,NSET=LEFT
*NGEN,NSET=RIGHT
*NFILL,NSET=ALL
LEFT,RIGHT,8,100
*ELEMENT,TYPE=M3D8, ELSET=EALL
*ELGEN,ELSET=EALL
*MEMBRANE SECTION,MATERIAL=A1, ELSET=EALL
.001,
*MATERIAL,NAME=A1
*ELASTIC,TYPE=ISOTROPIC
1.E6,.25
*NSET,NSET=DRIV,GEN
*NSET,NSET=PART,GEN
*ELSET,ELSET=ONE
*SUBMODEL,EXTER=0.005
DRIV,
*STEP,PERTURBATION
*STATIC
*BOUNDARY
801,1,,.24E-3
801,2,,.12E-3
809,1,,.3E-3
809,2,,.24E-3
*BOUNDARY,SUBMODEL,STEP=1
DRIV,1,3
*ENERGY PRINT
COORD
*NODE FILE,NSET=PART
 U,RF,CF
*ENERGY PRINT
*EL FILE,POSITION=CENTROID,ELSET=ONE
 S,
 E,
*NODE PRINT,NSET=PART
 U,
*END STEP
*STEP,NLGEOM
*STATIC
*CLOAD,FOLLOWER
801, 1, 0.6
809, 1, 0.6
809, 2, 1.2
*BOUNDARY
801,2
*BOUNDARY,SUBMODEL,STEP=2
DRIV,1,3
*EL FILE,ELSET=ONE
S,
*NODE PRINT,SUMMARY=NO,NSET=PART
U,
*NODE FILE,NSET=PART
U,RF
*END STEP