*HEADING
: SUBMODEL FROM PGC24AFD [AC2D4]
*NODE, Nset=ODB_NSET
*NGEN,NSET=NALL
*ELEMENT,TYPE=AC2D4,ELSET=EALL
*ELGEN,ELSET=EALL
*ELSET,ELSET=LINER3
*MATERIAL,NAME=AIR
*DENSITY
1.293,
*ACOUSTIC MEDIUM,BULK MODULUS
*SOLID SECTION,MATERIAL=AIR,ELSET=EALL
*IMPEDANCE PROPERTY,NAME=IMPED
*ngen,nset=driv
*submodel,absolute=0.03
driv,
**
** Sets added by addodb
**
*Elset,Elset=ODB_ESET
EALL,
**
**
*Nset, Nset=ODB_NSET
ODB_NSET, NALL, driv
**
**
*STEP
*STEADY STATE DYNAMIC,DIRECT
*IMPEDANCE
LINER3,I3,IMPED
*BOUNDARY,submodel,step=1
DRIV,8,8
*NODE PRINT
POR,PPOR
*NODE FILE
POR,PPOR
*OUTPUT,FIELD,VARIABLE=PRESELECT,OP=ADD,FREQUENCY=9999
*OUTPUT,FIELD, OP=ADD
*NODE OUTPUT
POR,
*OUTPUT,HISTORY,OP=ADD
*NODE OUTPUT, Nset=ODB_NSET
POR,
*END STEP