** : base problem for symmetric transfer problem: pm34srrev1
*heading
** ELEMENT : MAX1  ---> M3D4R
** FEATURE TESTED : *SYMMETRIC MODEL GEN.
**                  *SYMMETRIC RESULTS TRANSFER
*node, nset=nall
*element,type=cax4,elset=solid
*element,type=max1,elset=shell
*elset,elset=shell1
*elset,elset=shell2
*elset,elset=shell3
*solid section, elset=solid, material=soft
*membrane section, elset=shell1, material=soft
0.1,
*REBAR LAYER
REBAR1,0.1,0.2,0,STIFF,90,1
REBAR2,0.1,0.2,0,STIFF,0,1
REBAR3,0.1,0.2,0,STIFF,20,1
*membrane section, elset=shell2, material=soft
0.1,
*REBAR LAYER
REBAR3,0.1,0.2,0,STIFF,20,1
*membrane section, elset=shell3, material=soft
0.1,
*REBAR LAYER
REBAR3,0.1,0.2,0,STIFF,-20,1
*material, name=soft
*elastic
1.e4,0.3
*material, name=stiff
*elastic
1.e6, 0.3
*surface,name=s1
3,spos
*surface,name=s2
2,s1
*contact pair, interaction=tied,tied, adjust=0.005,smallsliding
s2,s1
*surface interaction,name=tied
*nset,nset=n1
*nset,nset=n2
*nset,nset=n4
*nset,nset=n8
*nset,nset=n7
*elset,elset=e2
*nset,nset=nhoop
*restart,w
*step,nlgeom
*static
1.0,1.0
*boundary
n1,1,2
n2,2,2
n4,1,1
n8,1,1
*dload
e2,p3,10.
*nodefile
u,
rf,
*elfile
s,
e,
*elfile,rebar
s,
e,
*endstep