*Heading
** Job name: shellsolidpipe_c3d20rsub_s4r Model name: Model-1
**
** PARTS
**
*Part, name=Part-1
*End Part
**
** ASSEMBLY
**
*Assembly, name=Assembly
**
*Instance, name=Part-1-1, part=Part-1
*Node
*Include, Input=pipe_submodel_c3d20r_sub_s4r_n.inp
*Element, type=C3D20R
*Include, Input=pipe_submodel_c3d20r_sub_s4r_e.inp
** Region: (Section-1:Picked)
*Elset, elset=_I1, internal, generate
** Section: Section-1
*Solid Section, elset=_I1, material=Material-1
1.,
*End Instance
*Nset, nset=_G13, internal, instance=Part-1-1
*Elset, elset=_G13, internal, instance=Part-1-1
*Nset, nset=Driven, internal, instance=Part-1-1
*Submodel, Shelltosolid, Shellthickness=0.001
 Driven,
*End Assembly
**
** MATERIALS
**
*Material, name=Material-1
*Elastic
 6.9e+10, 0.3
** ----------------------------------------------------------------
**
** STEP: Step-1
**
*Step, name=Step-1
 Total load of 10.0 N in the 1-direction
*Static
**
** BOUNDARY CONDITIONS
**
*Boundary
_G13, YSYMM
*Boundary, submodel,step=1
 Driven,
**
** OUTPUT REQUESTS
**
**
** FIELD OUTPUT: F-Output-1
**
*Output, field
*Node Output
U,
*Element Output
S,
**
** HISTORY OUTPUT: H-Output-1
**
*Output, history, variable=PRESELECT
*El Print, freq=0
*Node Print, freq=0
*End Step