*Heading
** Job name: shell2solidcoup_pipe_c3d20r_s4r Model name: Model-1
**
** PARTS
**
*Part, name=Part-1
*End Part
*Part, name=Part-2
*End Part
*Part, name=Part-3
*End Part
**
** ASSEMBLY
**
*Assembly, name=Assembly
**
*Instance, name=Part-1-1, part=Part-1
*Node
*Include, Input=pipe_shell2solid_c3d20r_s4r_n1.inp
*Element, type=C3D20R
*Include, Input=pipe_shell2solid_c3d20r_s4r_e1.inp
** Region: (Section-1:Picked)
*Elset, elset=_I1, internal, generate
** Section: Section-1
*Solid Section, elset=_I1, material=Material-1
1.,
*End Instance
**
*Instance, name=Part-2-1, part=Part-2
*Node
*Include, Input=pipe_shell2solid_c3d20r_s4r_n2.inp
*Element, type=S4R
*Include, Input=pipe_shell2solid_c3d20r_s4r_e2.inp
** Region: (Section-2:Picked)
*Elset, elset=_I1, internal, generate
** Section: Section-2
*Shell Section, elset=_I1, material=Material-1
0.00075, 5
*End Instance
**
*Instance, name=Part-3-1, part=Part-3
*Node
*Include, Input=pipe_shell2solid_c3d20r_s4r_n3.inp
*Element, type=S4R
*Include, Input=pipe_shell2solid_c3d20r_s4r_e3.inp
** Region: (Section-3:Picked)
*Elset, elset=_I1, internal, generate
** Section: Section-3
*Shell Section, elset=_I1, material=Material-1
0.001, 5
*End Instance
*Nset, nset=YSYMM1, internal, instance=Part-1-1
*Nset, nset=YSYMM1, internal, instance=Part-3-1
*Nset, nset=YSYMM2, internal, instance=Part-2-1
*Nset, nset=Fix, internal, instance=Part-3-1
*Nset, nset=Ref, internal, instance=Part-2-1
*Elset, elset=_SolidPipe_S2, internal, instance=Part-1-1, generate
*Surface, type=ELEMENT, name=SolidPipe
_SolidPipe_S2, S2
*Elset, elset=_SolidPlate_S5, internal, instance=Part-1-1, generate
*Surface, type=ELEMENT, name=SolidPlate
_SolidPlate_S5, S5
*Elset, elset=_PipeTop_E3, internal, instance=Part-2-1, generate
*Surface, type=ELEMENT, name=PipeTop
_PipeTop_E3, E3
*Elset, elset=_PipeSolid_E1, internal, instance=Part-2-1, generate
*Surface, type=ELEMENT, name=PipeSolid
_PipeSolid_E1, E1
*Elset, elset=_PlateSolid_E2, internal, instance=Part-3-1
*Elset, elset=_PlateSolid_E4, internal, instance=Part-3-1, generate
*Surface, type=ELEMENT, name=PlateSolid
_PlateSolid_E2, E2
_PlateSolid_E4, E4
** Constraint: Constraint-1
*Shell to solid, Constraint name=Constraint-1
PipeSolid, SolidPipe
** Constraint: Constraint-2
*Shell to solid, Constraint name=Constraint-2
PlateSolid, SolidPlate
** Constraint: Constraint-3
*Coupling, constraint name=Constraint-3, ref node = Ref, surface = PipeTop
*Distributing
*End Assembly
**
** MATERIALS
**
*Material, name=Material-1
*Elastic
 6.9e+10, 0.3
** ----------------------------------------------------------------
**
** STEP: Step-1
**
*Step, name=Step-1
 Total load of 10.0 N in the 1-direction
*Static
1., 1., 1e-05, 1.
**
** BOUNDARY CONDITIONS
**
*Boundary
YSYMM1, YSYMM
YSYMM2, YSYMM
Fix, 1, 6
Ref,  YSYMM
*Cload
 Ref, 1, 10.
**
** OUTPUT REQUESTS
**
**
** FIELD OUTPUT: F-Output-1
**
*Output, field
*Node Output
U,
*Element Output
S,
**
** HISTORY OUTPUT: H-Output-1
**
*Output, history, variable=PRESELECT
*El Print, freq=0
*Node Print, freq=0
*End Step