*HEADING
: SURFACE ELEMENT TEST  [SFM3D8R]
*PREPRINT,ECHO=YES,HISTORY=NO,MODEL=NO
*NODE
*NGEN
*ELEMENT,TYPE=SFM3D8R, ELSET=EALL
*ELSET,ELSET=EL3
*SURFACE SECTION,ELSET=EALL
*REBAR LAYER
REB,0.3,0.5,0,MAT2,0.0,1
REB_2,0.3,0.5,0,MAT2,90.0,1
REB_3,0.3,0.5,0,MAT2,45.0,1
*MATERIAL,NAME=MAT2
*ELASTIC,TYPE=ISOTROPIC
1.E6,.25
*NSET,NSET=SIDES,GENERATE
*STEP,PERTURBATION
*STATIC
*BOUNDARY
10,1,2
20,1,,.24E-3
20,2,,.12E-3
30,1,,.3E-3
30,2,,.24E-3
40,1,,.06E-3
40,2,,.12E-3
50,1,,.12E-3
*EL PRINT,ELSET=EALL,REBAR
S
E
RBANG
*EL FILE,ELSET=EALL,REBAR
S
E
RBANG
*NODE FILE
U,
*OUTPUT,FIELD
*NODE OUTPUT
U,
*ELEMENT OUTPUT,ELSET=EALL,REBAR
S
E
RBANG
*END STEP
*STEP,NLGEOM
*STATIC
*CLOAD,FOLLOWER
20, 1, 0.2
30, 1, 0.2
30, 2, 0.4
40, 1,-0.2
40, 2, 0.4
50, 2,-1.6
60, 1, 0.8
70, 2, 1.6
*BOUNDARY
10,1,2
20,2
*EL PRINT,ELSET=EALL,REBAR
S
E
RBANG
*EL FILE,ELSET=EALL,REBAR
S
E
RBANG
*OUTPUT,FIELD
*ELEMENT OUTPUT,ELSET=EALL,REBAR
S
E
RBANG
*NODE PRINT,SUMMARY=NO
U,RF
*NODE FILE
U,RF
*OUTPUT,FIELD
*NODE OUTPUT
U,RF
*END STEP