*HEADING
Global analysis: 3 x 3 mesh with cps8rt.     File name:
*NODE,NSET=ALL
*NGEN,NSET=NL
*NGEN,NSET=NR
*NFILL,NSET=ALL
NL,NR,6,10
*NSET,NSET=FIX1,GEN
*NSET,NSET=FIX2,GEN
*NSET,NSET=FIX3,GEN
*NSET,NSET=FIX4,GEN
*NSET,NSET=NALL
FIX1,FIX2,FIX3,FIX4
*ELEMENT, TYPE=CPS8RT, ELSET=EALL
*ELGEN,ELSET=EALL
*ELSET,ELSET=EFLUX2
*SOLID SECTION,MATERIAL=A1, ELSET=EALL
*MATERIAL,NAME=A1
*ELASTIC
 30.E6, .3
*EXPANSION
 1.E-5,
*CONDUCTIVITY
 3.77E-5,
*SPECIFIC HEAT
 .39,
*DENSITY
 82.9,
*RESTART,WRITE
*STEP
*COUPLED TEMPERATURE-DISPLACEMENT, STEADY STATE
 .000001, .000001
*BOUNDARY, OP=NEW
 FIX1,  2
 FIX4,  1
 FIX4, 11
*DFLUX,OP=NEW
 EFLUX2, S2, .3
*ENERGY FILE
*OUTPUT,HISTORY,FREQUENCY=1
*ENERGY OUTPUT,VARIABLE=PRESELECT
*EL FILE
 LOADS,FLUXS
 FILM,RAD
*NODE FILE
 U,
 RF,
 NT,
 RFL,
*OUTPUT,FIELD
*NODE OUTPUT
U,
RF,
NT,
RFL,
*EL PRINT
 LOADS,FLUXS
 FILM,RAD
*NODE PRINT
 U,
 RF,
 NT,
 RFL,
*END STEP