*HEADING
Global analysis: 3 x 3 x 2 mesh with cpe6mp.     File name:
***PREPRINT,ECHO=YES,HISTORY=NO,MODEL=NO
*RESTART,WRITE,FREQ=1
*NODE
*NGEN,NSET=NL
*NGEN,NSET=NR
*NFILL,NSET=ALL
NL,NR,6,10
*NSET,NSET=FIX1,GEN
*NSET,NSET=FIX2,GEN
*NSET,NSET=FIX3,GEN
*NSET,NSET=FIX4,GEN
*NSET,NSET=NALL
FIX1,FIX2,FIX3,FIX4
*ELEMENT, TYPE=CPE6MP, ELSET=EALL
*ELSET,ELSET=EFLOW2
*SOLID SECTION,MATERIAL=A1, ELSET=EALL
*MATERIAL,NAME=A1
*ELASTIC
 1.E8,
*PERMEABILITY
 1.E-5,
*DENSITY
  1.4142,
*INITIAL CONDITIONS,TYPE=RATIO
ALL,1.
*STEP
*SOILS,CONSOLIDATION
*ENERGY FILE
*OUTPUT,HISTORY,FREQUENCY=1
*ENERGY OUTPUT,VARIABLE=PRESELECT
*EL FILE
 LOADS,
 IVOL,
 EVOL,
*OUTPUT,FIELD
*ELEMENT OUTPUT
LOADS,
IVOL,
EVOL,
POR,
*NODE FILE
U,RF,POR,RVT
*OUTPUT,FIELD
*NODE OUTPUT
U,RF,POR,RVT
*EL PRINT,TOTALS=YES
 LOADS,
 IVOL,
 EVOL,
*NODE PRINT
 RF,
 POR,
*BOUNDARY,OP=NEW
FIX1, 2
FIX4, 1
FIX4, 8
*FLOW, OP=NEW
EFLOW2, Q2, 14.7, 2.E-3
*END STEP