*HEADING
40 MM NOTCHED BEAM 3 POINT BENDING, CPS4R
*** FINE MESH
*** UNITS: NEWTON, METER
*NODE
*NGEN,NSET=LHS
*NGEN,NSET=L900
*NGEN,NSET=LNOTCH
*NGEN,NSET=CENT
*NFILL,NSET=BACK
LHS,L900,36,30
L900,LNOTCH,8,30
LNOTCH,CENT,4,30
*NSET,NSET=NOUT
*NSET,NSET=CENSYM,GEN
*ELEMENT,TYPE=CPS4R
*ELGEN,ELSET=BEAM
*ELSET,GEN,ELSET=EOUT
*SOLID SECTION,ELSET=BEAM,MATE=CONC
0.05,
*MATERIAL,NAME=CONC
*DENSITY
2400.,
*ELASTIC
30.E9,.2
*CONCRETE DAMAGED PLASTICITY
*CONCRETE COMPRESSION HARDENING
*CONCRETE TENSION DAMAGE, TYPE=DISPLACEMENT
*CONCRETE TENSION STIFFENING,TYPE=DISPLACEMENT
*BOUNDARY
CENSYM,1
1,2
*RESTART,WRITE
**
*STEP,INC=100,NLGEOM
*STATIC,RIKS
0.001,1.0,,0.02,,1465,2,-1.5E-03
*BOUNDARY
1465,2,2,-1.5E-03
*MONITOR,DOF=2,NODE=1465
*OUTPUT, FIELD, VARIABLE=PRESELECT
*ELEMENT OUTPUT
PEEQ, PEEQT, DAMAGET, DAMAGEC, SDEG
*OUTPUT,HISTORY,VARIABLE=PRESELECTED
*ELEMENT OUTPUT,ELSET=EOUT
S,E
*NODE OUTPUT,NSET=NOUT
U,RF
*END STEP