*HEADING
ABAQUS job created on 22-Aug-96 at 16:20:52
**
*rest,w,freq=999
*NODE
**
**
*ELEMENT, TYPE=C3D4, ELSET=alle
**
**
*nset, nset=x0
*nset, nset=x10,gen
*nset, nset=x10,gen
*nset, nset=x10,gen
*nset, nset=x10mid
*nset, nset=x0mid
*nset, nset=nmid
*elset, elset=emid
*SOLID SECTION, ELSET=ALLE, MATERIAL=MAT
*MATERIAL, NAME=MAT
*DENSITY
8000.,
*ELASTIC
200.E9,0.3
*DAMPING,ALPHA=5.36,BETA=7.46E-5
**
** HARMONIC LOAD
** -------------
**
*STEP,PERT
*STEADY STATE DYNAMICS,DIRECT,FREQUENCY SCALE = LINEAR
40.,50.,50,1
*LOAD CASE,NAME=CASE-1
*BOUNDARY,OP=NEW
X0,3,3
x10,3,3
x0mid,1,2
x10mid,2,2
*DLOAD, OP=NEW
    1121, P2,       -0.5E6
    1124, P2,       -0.5E6
    1127, P4,       -0.5E6
    1128, P4,       -0.5E6
    1131, P2,       -0.5E6
    1134, P2,       -0.5E6
    1137, P4,       -0.5E6
    1138, P4,       -0.5E6
    1141, P2,       -0.5E6
    1144, P2,       -0.5E6
    1147, P4,       -0.5E6
    1148, P4,       -0.5E6
    1151, P2,       -0.5E6
    1154, P2,       -0.5E6
    1157, P4,       -0.5E6
    1158, P4,       -0.5E6
    1161, P2,       -0.5E6
    1164, P2,       -0.5E6
    1167, P4,       -0.5E6
    1168, P4,       -0.5E6
** ... 236 like lines cut
*END LOAD CASE
*LOAD CASE,NAME=CASE-2
*BOUNDARY,OP=NEW
X0,3,3
x10,3,3
x0mid,2,2
x10mid,1,2
*DLOAD, OP=NEW
    1121, P2,        0.5E6
    1124, P2,        0.5E6
    1127, P4,        0.5E6
    1128, P4,        0.5E6
    1131, P2,        0.5E6
    1134, P2,        0.5E6
    1137, P4,        0.5E6
    1138, P4,        0.5E6
    1141, P2,        0.5E6
    1144, P2,        0.5E6
    1147, P4,        0.5E6
    1148, P4,        0.5E6
    1151, P2,        0.5E6
    1154, P2,        0.5E6
    1157, P4,        0.5E6
    1158, P4,        0.5E6
    1161, P2,        0.5E6
    1164, P2,        0.5E6
    1167, P4,        0.5E6
    1168, P4,        0.5E6
** ... 236 like lines cut
*END LOAD CASE
*NODE PRINT,NSET=NMID,FRE=16
U2,
*OUTPUT,FIELD
*NODE OUTPUT,NSET=NMID
U,
*EL PRINT,FRE=16,POSITION=AVERAGED AT NODES,ELSET=EMID
S,
*ENDSTEP