*************************************************************************
** NOTE: PLOT CEF FOR ELASTO-PLASTIC FORCE RESPONSE			*
**									*
**									*
*************************************************************************
*HEADING
TEST PLASTIC CONNECTOR BEHAVIOR - 3D - LINEAR ELASTICITY
*PREPRINT, MODEL=YES
*************************************************************************
**              SECTION I : TRUSS PLASTICITY (REFERENCE)
*************************************************************************
**
*************** ISOTROPIC TABULAR REFERENCE ****************
*NODE, NSET=REF1
*ELEMENT, TYPE=T3D2, ELSET=REF1
*SOLID SECTION,ELSET=REF1,MATERIAL=TRUSS_ISO_TAB
1.0,
*MATERIAL,NAME=TRUSS_ISO_TAB
*DENSITY
1e-3,
*ELASTIC
200E3, 0.3
*PLASTIC, HARDENING=ISOTROPIC
*INCLUDE, INPUT=misc_plas_data1.inp
**
************* ISOTROPIC EXPONENTIAL REFERENCE ****************
*NODE, NSET=REF2
*ELEMENT, TYPE=T3D2, ELSET=REF2
*SOLID SECTION,ELSET=REF2,MATERIAL=TRUSS_ISO_EXP
1.0,
*MATERIAL,NAME=TRUSS_ISO_EXP
*DENSITY
1e-3,
*ELASTIC
200E3, 0.3
*PLASTIC, HARDENING=COMBINED, DATATYPE=PARAMETERS
200, 0, 0
*CYCLIC HARDENING, PARAMETERS
**
****************** KINEMATIC HALF CYCLE REFERENCE  *************
*NODE, NSET=REF3
*ELEMENT, TYPE=T3D2, ELSET=REF3
*SOLID SECTION,ELSET=REF3,MATERIAL=TRUSS_KIN_HC
1.0,
*MATERIAL,NAME=TRUSS_KIN_HC
*DENSITY
1e-3,
*ELASTIC
200E3, 0.3
*PLASTIC, HARDENING=COMBINED, DATATYPE=HALFCYCLE
*INCLUDE, INPUT=misc_plas_data2.inp
**
****************** KINEMATIC STABILIZED REFERENCE***********
*NODE, NSET=REF4
*ELEMENT, TYPE=T3D2, ELSET=REF4
*SOLID SECTION,ELSET=REF4,MATERIAL=TRUSS_KIN_STAB
1.0,
*MATERIAL,NAME=TRUSS_KIN_STAB
*DENSITY
1e-3,
*ELASTIC
200E3, 0.3
*PLASTIC, HARDENING=COMBINED, DATATYPE=STAB
*INCLUDE, INPUT=misc_plas_data2.inp
**
****************** KINEMATIC PARAMETER REFERENCE ***********
*NODE, NSET=REF5
*ELEMENT, TYPE=T3D2, ELSET=REF5
*SOLID SECTION,ELSET=REF5,MATERIAL=TRUSS_KIN_PARAM
1.0,
*MATERIAL,NAME=TRUSS_KIN_PARAM
*DENSITY
1e-3,
*ELASTIC
200E3, 0.3
*PLASTIC, HARDENING=COMBINED, DATATYPE=PARAM
200, 1421.5, 15.008
**
*********************** COMBINED REFERENCE *****************
*NODE, NSET=REF6
*ELEMENT, TYPE=T3D2, ELSET=REF6
*SOLID SECTION,ELSET=REF6,MATERIAL=TRUSS_ISO_KIN
1.0,
*MATERIAL,NAME=TRUSS_ISO_KIN
*DENSITY
1e-3,
*ELASTIC
200E3, 0.3
*PLASTIC, HARDENING=COMBINED, DATATYPE=PARAM
200, 1421.5, 15.008
*CYCLIC HARDENING, PARAMETERS
**
********************************************************************
**		SECTION II : CONNECTOR MODEL DATA
********************************************************************
**
**********************  TEST 11 *****************************
*NODE, NSET=N11
*ELEMENT, TYPE=CONN3D2, ELSET=C11
*CONNECTOR SECTION, ELSET=C11, BEHAVIOR=B11
CARTESIAN, CARDAN
GLOB11,
*ORIENTATION, NAME=GLOB11
**
*CONNECTOR BEHAVIOR, NAME=B11
*INCLUDE, INPUT=misc_elas_conn3d.inp
*INCLUDE, INPUT=misc_plas_comp1.inp
*INCLUDE, INPUT=misc_hard_iso_tab.inp
*INCLUDE, INPUT=misc_plas_comp4.inp
*INCLUDE, INPUT=misc_hard_iso_tab.inp
**
*ELEMENT, TYPE=MASS, ELSET=M11
*MASS, ELSET=M11
1E-3
*ELEMENT, TYPE=ROTARYI, ELSET=R11
*ROTARY INERTIA, ELSET=R11
1E-4, 1E-4, 1E-4
**********************  TEST 12 *****************************
*NODE, NSET=N12
*ELEMENT, TYPE=CONN3D2, ELSET=C12
*CONNECTOR SECTION, ELSET=C12, BEHAVIOR=B12
CARTESIAN, CARDAN
GLOB12,
*ORIENTATION, NAME=GLOB12
**
*CONNECTOR BEHAVIOR, NAME=B12
*INCLUDE, INPUT=misc_elas_conn3d.inp
*INCLUDE, INPUT=misc_plas_comp1.inp
*INCLUDE, INPUT=misc_hard_iso_exp.inp
*INCLUDE, INPUT=misc_plas_comp4.inp
*INCLUDE, INPUT=misc_hard_iso_exp.inp
**
*ELEMENT, TYPE=MASS, ELSET=M12
*MASS, ELSET=M12
1E-3
*ELEMENT, TYPE=ROTARYI, ELSET=R12
*ROTARY INERTIA, ELSET=R12
1E-4, 1E-4, 1E-4
**********************  TEST 13 *****************************
*NODE, NSET=N13
*ELEMENT, TYPE=CONN3D2, ELSET=C13
*CONNECTOR SECTION, ELSET=C13, BEHAVIOR=B13
CARTESIAN, CARDAN
GLOB13,
*ORIENTATION, NAME=GLOB13
**
*CONNECTOR BEHAVIOR, NAME=B13
*INCLUDE, INPUT=misc_elas_conn3d.inp
*INCLUDE, INPUT=misc_plas_comp1.inp
*INCLUDE, INPUT=misc_hard_kin_hc.inp
*INCLUDE, INPUT=misc_plas_comp4.inp
*INCLUDE, INPUT=misc_hard_kin_hc.inp
**
*ELEMENT, TYPE=MASS, ELSET=M13
*MASS, ELSET=M13
1E-3
*ELEMENT, TYPE=ROTARYI, ELSET=R13
*ROTARY INERTIA, ELSET=R13
1E-4, 1E-4, 1E-4
**********************  TEST 14 *****************************
*NODE, NSET=N14
*ELEMENT, TYPE=CONN3D2, ELSET=C14
*CONNECTOR SECTION, ELSET=C14, BEHAVIOR=B14
CARTESIAN, CARDAN
GLOB14,
*ORIENTATION, NAME=GLOB14
**
*CONNECTOR BEHAVIOR, NAME=B14
*INCLUDE, INPUT=misc_elas_conn3d.inp
*INCLUDE, INPUT=misc_plas_comp1.inp
*INCLUDE, INPUT=misc_hard_kin_stab.inp
*INCLUDE, INPUT=misc_plas_comp4.inp
*INCLUDE, INPUT=misc_hard_kin_stab.inp
**
*ELEMENT, TYPE=MASS, ELSET=M14
*MASS, ELSET=M14
1E-3
*ELEMENT, TYPE=ROTARYI, ELSET=R14
*ROTARY INERTIA, ELSET=R14
1E-4, 1E-4, 1E-4
**********************  TEST 15 *****************************
*NODE, NSET=N15
*ELEMENT, TYPE=CONN3D2, ELSET=C15
*CONNECTOR SECTION, ELSET=C15, BEHAVIOR=B15
CARTESIAN, CARDAN
GLOB15,
*ORIENTATION, NAME=GLOB15
**
*CONNECTOR BEHAVIOR, NAME=B15
*INCLUDE, INPUT=misc_elas_conn3d.inp
*INCLUDE, INPUT=misc_plas_comp1.inp
*INCLUDE, INPUT=misc_hard_kin_par.inp
*INCLUDE, INPUT=misc_plas_comp4.inp
*INCLUDE, INPUT=misc_hard_kin_par.inp
**
*ELEMENT, TYPE=MASS, ELSET=M15
*MASS, ELSET=M15
1E-3
*ELEMENT, TYPE=ROTARYI, ELSET=R15
*ROTARY INERTIA, ELSET=R15
1E-4, 1E-4, 1E-4
**********************  TEST 16 *****************************
*NODE, NSET=N16
*ELEMENT, TYPE=CONN3D2, ELSET=C16
*CONNECTOR SECTION, ELSET=C16, BEHAVIOR=B16
CARTESIAN, CARDAN
GLOB16,
*ORIENTATION, NAME=GLOB16
**
*CONNECTOR BEHAVIOR, NAME=B16
*INCLUDE, INPUT=misc_elas_conn3d.inp
*INCLUDE, INPUT=misc_plas_comp1.inp
*INCLUDE, INPUT=misc_hard_kin_par.inp
*INCLUDE, INPUT=misc_hard_iso_exp.inp
*INCLUDE, INPUT=misc_plas_comp4.inp
*INCLUDE, INPUT=misc_hard_kin_par.inp
*INCLUDE, INPUT=misc_hard_iso_exp.inp
**
*ELEMENT, TYPE=MASS, ELSET=M16
*MASS, ELSET=M16
1E-3
*ELEMENT, TYPE=ROTARYI, ELSET=R16
*ROTARY INERTIA, ELSET=R16
1E-4, 1E-4, 1E-4
**********************  TEST 21 *****************************
*NODE, NSET=N21
*ELEMENT, TYPE=CONN3D2, ELSET=C21
*CONNECTOR SECTION, ELSET=C21, BEHAVIOR=B21
CARTESIAN, CARDAN
GLOB21,
*ORIENTATION, NAME=GLOB21
**
*CONNECTOR BEHAVIOR, NAME=B21
*INCLUDE, INPUT=misc_elas_conn3d.inp
*INCLUDE, INPUT=misc_plas_coupled_quad.inp
*INCLUDE, INPUT=misc_hard_iso_tab.inp
**
*ELEMENT, TYPE=MASS, ELSET=M21
*MASS, ELSET=M21
1E-3
*ELEMENT, TYPE=ROTARYI, ELSET=R21
*ROTARY INERTIA, ELSET=R21
1E-4, 1E-4, 1E-4
**********************  TEST 22 *****************************
*NODE, NSET=N22
*ELEMENT, TYPE=CONN3D2, ELSET=C22
*CONNECTOR SECTION, ELSET=C22, BEHAVIOR=B22
CARTESIAN, CARDAN
GLOB22,
*ORIENTATION, NAME=GLOB22
**
*CONNECTOR BEHAVIOR, NAME=B22
*INCLUDE, INPUT=misc_elas_conn3d.inp
*INCLUDE, INPUT=misc_plas_coupled_quad.inp
*INCLUDE, INPUT=misc_hard_iso_exp.inp
**
*ELEMENT, TYPE=MASS, ELSET=M22
*MASS, ELSET=M22
1E-3
*ELEMENT, TYPE=ROTARYI, ELSET=R22
*ROTARY INERTIA, ELSET=R22
1E-4, 1E-4, 1E-4
**********************  TEST 23 *****************************
*NODE, NSET=N23
*ELEMENT, TYPE=CONN3D2, ELSET=C23
*CONNECTOR SECTION, ELSET=C23, BEHAVIOR=B23
CARTESIAN, CARDAN
GLOB23,
*ORIENTATION, NAME=GLOB23
**
*CONNECTOR BEHAVIOR, NAME=B23
*INCLUDE, INPUT=misc_elas_conn3d.inp
*INCLUDE, INPUT=misc_plas_coupled_quad.inp
*INCLUDE, INPUT=misc_hard_kin_hc.inp
**
*ELEMENT, TYPE=MASS, ELSET=M23
*MASS, ELSET=M23
1E-3
*ELEMENT, TYPE=ROTARYI, ELSET=R23
*ROTARY INERTIA, ELSET=R23
1E-4, 1E-4, 1E-4
**********************  TEST 24 *****************************
*NODE, NSET=N24
*ELEMENT, TYPE=CONN3D2, ELSET=C24
*CONNECTOR SECTION, ELSET=C24, BEHAVIOR=B24
CARTESIAN, CARDAN
GLOB24,
*ORIENTATION, NAME=GLOB24
**
*CONNECTOR BEHAVIOR, NAME=B24
*INCLUDE, INPUT=misc_elas_conn3d.inp
*INCLUDE, INPUT=misc_plas_coupled_quad.inp
*INCLUDE, INPUT=misc_hard_kin_stab.inp
**
*ELEMENT, TYPE=MASS, ELSET=M24
*MASS, ELSET=M24
1E-3
*ELEMENT, TYPE=ROTARYI, ELSET=R24
*ROTARY INERTIA, ELSET=R24
1E-4, 1E-4, 1E-4
**********************  TEST 25 *****************************
*NODE, NSET=N25
*ELEMENT, TYPE=CONN3D2, ELSET=C25
*CONNECTOR SECTION, ELSET=C25, BEHAVIOR=B25
CARTESIAN, CARDAN
GLOB25,
*ORIENTATION, NAME=GLOB25
**
*CONNECTOR BEHAVIOR, NAME=B25
*INCLUDE, INPUT=misc_elas_conn3d.inp
*INCLUDE, INPUT=misc_plas_coupled_quad.inp
*INCLUDE, INPUT=misc_hard_kin_par.inp
**
*ELEMENT, TYPE=MASS, ELSET=M25
*MASS, ELSET=M25
1E-3
*ELEMENT, TYPE=ROTARYI, ELSET=R25
*ROTARY INERTIA, ELSET=R25
1E-4, 1E-4, 1E-4
**********************  TEST 26 *****************************
*NODE, NSET=N26
*ELEMENT, TYPE=CONN3D2, ELSET=C26
*CONNECTOR SECTION, ELSET=C26, BEHAVIOR=B26
CARTESIAN, CARDAN
GLOB26,
*ORIENTATION, NAME=GLOB26
**
*CONNECTOR BEHAVIOR, NAME=B26
*INCLUDE, INPUT=misc_elas_conn3d.inp
*INCLUDE, INPUT=misc_plas_coupled_quad.inp
*INCLUDE, INPUT=misc_hard_iso_exp.inp
*INCLUDE, INPUT=misc_hard_kin_par.inp
**
*ELEMENT, TYPE=MASS, ELSET=M26
*MASS, ELSET=M26
1E-3
*ELEMENT, TYPE=ROTARYI, ELSET=R26
*ROTARY INERTIA, ELSET=R26
1E-4, 1E-4, 1E-4
**********************  TEST 31 *****************************
*NODE, NSET=N31
*ELEMENT, TYPE=CONN3D2, ELSET=C31
*CONNECTOR SECTION, ELSET=C31, BEHAVIOR=B31
CARTESIAN, CARDAN
GLOB31,
*ORIENTATION, NAME=GLOB31
**
*CONNECTOR BEHAVIOR, NAME=B31
*INCLUDE, INPUT=misc_elas_conn3d.inp
*INCLUDE, INPUT=misc_plas_coupled_quad.inp
*INCLUDE, INPUT=misc_hard_iso_tab.inp
*INCLUDE, INPUT=misc_plas_comp1.inp
*INCLUDE, INPUT=misc_hard_iso_tab.inp
*INCLUDE, INPUT=misc_plas_comp4.inp
*INCLUDE, INPUT=misc_hard_iso_tab.inp
**
*ELEMENT, TYPE=MASS, ELSET=M31
*MASS, ELSET=M31
1E-3
*ELEMENT, TYPE=ROTARYI, ELSET=R31
*ROTARY INERTIA, ELSET=R31
1E-4, 1E-4, 1E-4
**********************  TEST 32 *****************************
*NODE, NSET=N32
*ELEMENT, TYPE=CONN3D2, ELSET=C32
*CONNECTOR SECTION, ELSET=C32, BEHAVIOR=B32
CARTESIAN, CARDAN
GLOB32,
*ORIENTATION, NAME=GLOB32
**
*CONNECTOR BEHAVIOR, NAME=B32
*INCLUDE, INPUT=misc_elas_conn3d.inp
*INCLUDE, INPUT=misc_plas_coupled_quad.inp
*INCLUDE, INPUT=misc_hard_iso_exp.inp
*INCLUDE, INPUT=misc_plas_comp1.inp
*INCLUDE, INPUT=misc_hard_iso_exp.inp
*INCLUDE, INPUT=misc_plas_comp4.inp
*INCLUDE, INPUT=misc_hard_iso_exp.inp
**
*ELEMENT, TYPE=MASS, ELSET=M32
*MASS, ELSET=M32
1E-3
*ELEMENT, TYPE=ROTARYI, ELSET=R32
*ROTARY INERTIA, ELSET=R32
1E-4, 1E-4, 1E-4
**********************  TEST 33 *****************************
*NODE, NSET=N33
*ELEMENT, TYPE=CONN3D2, ELSET=C33
*CONNECTOR SECTION, ELSET=C33, BEHAVIOR=B33
CARTESIAN, CARDAN
GLOB33,
*ORIENTATION, NAME=GLOB33
**
*CONNECTOR BEHAVIOR, NAME=B33
*INCLUDE, INPUT=misc_elas_conn3d.inp
*INCLUDE, INPUT=misc_plas_coupled_quad.inp
*INCLUDE, INPUT=misc_hard_kin_hc.inp
*INCLUDE, INPUT=misc_plas_comp1.inp
*INCLUDE, INPUT=misc_hard_kin_hc.inp
*INCLUDE, INPUT=misc_plas_comp4.inp
*INCLUDE, INPUT=misc_hard_kin_hc.inp
**
*ELEMENT, TYPE=MASS, ELSET=M33
*MASS, ELSET=M33
1E-3
*ELEMENT, TYPE=ROTARYI, ELSET=R33
*ROTARY INERTIA, ELSET=R33
1E-4, 1E-4, 1E-4
**********************  TEST 34 *****************************
*NODE, NSET=N34
*ELEMENT, TYPE=CONN3D2, ELSET=C34
*CONNECTOR SECTION, ELSET=C34, BEHAVIOR=B34
CARTESIAN, CARDAN
GLOB34,
*ORIENTATION, NAME=GLOB34
**
*CONNECTOR BEHAVIOR, NAME=B34
*INCLUDE, INPUT=misc_elas_conn3d.inp
*INCLUDE, INPUT=misc_plas_coupled_quad.inp
*INCLUDE, INPUT=misc_hard_kin_stab.inp
*INCLUDE, INPUT=misc_plas_comp1.inp
*INCLUDE, INPUT=misc_hard_kin_stab.inp
*INCLUDE, INPUT=misc_plas_comp4.inp
*INCLUDE, INPUT=misc_hard_kin_stab.inp
**
*ELEMENT, TYPE=MASS, ELSET=M34
*MASS, ELSET=M34
1E-3
*ELEMENT, TYPE=ROTARYI, ELSET=R34
*ROTARY INERTIA, ELSET=R34
1E-4, 1E-4, 1E-4
**********************  TEST 35 *****************************
*NODE, NSET=N35
*ELEMENT, TYPE=CONN3D2, ELSET=C35
*CONNECTOR SECTION, ELSET=C35, BEHAVIOR=B35
CARTESIAN, CARDAN
GLOB35,
*ORIENTATION, NAME=GLOB35
**
*CONNECTOR BEHAVIOR, NAME=B35
*INCLUDE, INPUT=misc_elas_conn3d.inp
*INCLUDE, INPUT=misc_plas_coupled_quad.inp
*INCLUDE, INPUT=misc_hard_kin_par.inp
*INCLUDE, INPUT=misc_plas_comp1.inp
*INCLUDE, INPUT=misc_hard_kin_par.inp
*INCLUDE, INPUT=misc_plas_comp4.inp
*INCLUDE, INPUT=misc_hard_kin_par.inp
**
*ELEMENT, TYPE=MASS, ELSET=M35
*MASS, ELSET=M35
1E-3
*ELEMENT, TYPE=ROTARYI, ELSET=R35
*ROTARY INERTIA, ELSET=R35
1E-4, 1E-4, 1E-4
**********************  TEST 36 *****************************
*NODE, NSET=N36
*ELEMENT, TYPE=CONN3D2, ELSET=C36
*CONNECTOR SECTION, ELSET=C36, BEHAVIOR=B36
CARTESIAN, CARDAN
GLOB36,
*ORIENTATION, NAME=GLOB36
**
*CONNECTOR BEHAVIOR, NAME=B36
*INCLUDE, INPUT=misc_elas_conn3d.inp
*INCLUDE, INPUT=misc_plas_coupled_quad.inp
*INCLUDE, INPUT=misc_hard_kin_par.inp
*INCLUDE, INPUT=misc_hard_iso_exp.inp
*INCLUDE, INPUT=misc_plas_comp1.inp
*INCLUDE, INPUT=misc_hard_kin_par.inp
*INCLUDE, INPUT=misc_hard_iso_exp.inp
*INCLUDE, INPUT=misc_plas_comp4.inp
*INCLUDE, INPUT=misc_hard_kin_par.inp
*INCLUDE, INPUT=misc_hard_iso_exp.inp
**
*ELEMENT, TYPE=MASS, ELSET=M36
*MASS, ELSET=M36
1E-3
*ELEMENT, TYPE=ROTARYI, ELSET=R36
*ROTARY INERTIA, ELSET=R36
1E-4, 1E-4, 1E-4
**********************  TEST 46 *****************************
*NODE, NSET=N46
*ELEMENT, TYPE=CONN3D2, ELSET=C46
*CONNECTOR SECTION, ELSET=C46, BEHAVIOR=B46
CARTESIAN, CARDAN
GLOB46,
*ORIENTATION, NAME=GLOB46
**
*CONNECTOR BEHAVIOR, NAME=B46
*INCLUDE, INPUT=misc_elas_conn3d.inp
*INCLUDE, INPUT=misc_plas_coupled_lin.inp
*INCLUDE, INPUT=misc_hard_kin_par.inp
*INCLUDE, INPUT=misc_hard_iso_exp.inp
**
*ELEMENT, TYPE=MASS, ELSET=M46
*MASS, ELSET=M46
1E-3
*ELEMENT, TYPE=ROTARYI, ELSET=R46
*ROTARY INERTIA, ELSET=R46
1E-4, 1E-4, 1E-4
**********************  TEST 56 *****************************
*NODE, NSET=N56
*ELEMENT, TYPE=CONN3D2, ELSET=C56
*CONNECTOR SECTION, ELSET=C56, BEHAVIOR=B56
CARTESIAN, CARDAN
GLOB56,
*ORIENTATION, NAME=GLOB56
**
*CONNECTOR BEHAVIOR, NAME=B56
*INCLUDE, INPUT=misc_elas_conn3d.inp
*INCLUDE, INPUT=misc_plas_coupled_beta.inp
*INCLUDE, INPUT=misc_hard_kin_par.inp
*INCLUDE, INPUT=misc_hard_iso_exp.inp
**
*ELEMENT, TYPE=MASS, ELSET=M56
*MASS, ELSET=M56
1E-3
*ELEMENT, TYPE=ROTARYI, ELSET=R56
*ROTARY INERTIA, ELSET=R56
1E-4, 1E-4, 1E-4
********************************************************************
**		SECTION III : HISTORY DATA - DYNAMIC EXPLICIT TESTS
********************************************************************
**
*STEP, nlgeom=yes
*DYNAMIC, EXPLICIT
,1
**
**
*************** ISOTROPIC TABULAR REFERENCE ****************
*AMPLITUDE, NAME=CYCLE_REF1, DEFINITION=PERIODIC
1,31.4,0,0
0,1,
*BOUNDARY, AMPLITUDE=CYCLE_REF1
1001,1,6,
1002,1,1,
1002,3,6,
1002,2,2,0.05
*OUTPUT, HISTORY, FREQUENCY=50
*ELEMENT OUTPUT, ELSET=REF1
PE11, S11, E11
************* ISOTROPIC EXPONENTIAL REFERENCE ****************
*AMPLITUDE, NAME=CYCLE_REF2, DEFINITION=PERIODIC
1,31.4,0,0
0,1,
*BOUNDARY, AMPLITUDE=CYCLE_REF2
2001,1,6,
2002,1,1,
2002,3,6,
2002,2,2,0.05
*OUTPUT, HISTORY, FREQUENCY=50
*ELEMENT OUTPUT, ELSET=REF2
PE11, S11, E11
****************** KINEMATIC HALF CYCLE REFERENCE ************
*AMPLITUDE, NAME=CYCLE_REF3, DEFINITION=PERIODIC
1,31.4,0,0
0,1,
*BOUNDARY, AMPLITUDE=CYCLE_REF3
3001,1,6,
3002,1,1,
3002,3,6,
3002,2,2,0.05
*OUTPUT, HISTORY, FREQUENCY=50
*ELEMENT OUTPUT, ELSET=REF3
PE11, S11, E11
****************** KINEMATIC STABILIZED REFERENCE ***********
*AMPLITUDE, NAME=CYCLE_REF4, DEFINITION=PERIODIC
1,31.4,0,0
0,1,
*BOUNDARY, AMPLITUDE=CYCLE_REF4
4001,1,6,
4002,1,1,
4002,3,6,
4002,2,2,0.05
*OUTPUT, HISTORY, FREQUENCY=50
*ELEMENT OUTPUT, ELSET=REF4
PE11, S11, E11
****************** KINEMATIC PARAMETER REFERENCE ************
*AMPLITUDE, NAME=CYCLE_REF5, DEFINITION=PERIODIC
1,31.4,0,0
0,1,
*BOUNDARY, AMPLITUDE=CYCLE_REF5
5001,1,6,
5002,1,1,
5002,3,6,
5002,2,2,0.05
*OUTPUT, HISTORY, FREQUENCY=50
*ELEMENT OUTPUT, ELSET=REF5
PE11, S11, E11
*********************** COMBINED REFERENCE ******************
*AMPLITUDE, NAME=CYCLE_REF6, DEFINITION=PERIODIC
1,31.4,0,0
0,1,
*BOUNDARY, AMPLITUDE=CYCLE_REF6
6001,1,6,
6002,1,1,
6002,3,6,
6002,2,2,0.05
*OUTPUT, HISTORY, FREQUENCY=50
*ELEMENT OUTPUT, ELSET=REF6
PE11, S11, E11
************************ TEST 11 **************************
*AMPLITUDE, NAME=CYCLE_11, DEFINITION=PERIODIC
1,31.4,0,0
0,1,
*BOUNDARY
111,1,6,
*CONNECTOR MOTION, AMPLITUDE=CYCLE_11
*OUTPUT, HISTORY
*ELEMENT OUTPUT, ELSET=C11
CU, CUE, CUP, CUPEQ, CEF, CRF, CALPHAF
************************ TEST 12 **************************
*AMPLITUDE, NAME=CYCLE_12, DEFINITION=PERIODIC
1,31.4,0,0
0,1,
*BOUNDARY
121,1,6,
*CONNECTOR MOTION, AMPLITUDE=CYCLE_12
*OUTPUT, HISTORY
*ELEMENT OUTPUT, ELSET=C12
CU, CUE, CUP, CUPEQ, CEF, CRF, CALPHAF
********************** TEST 13 *****************************
*AMPLITUDE, NAME=CYCLE_13, DEFINITION=PERIODIC
1,31.4,0,0
0,1,
*BOUNDARY
131,1,6,
*CONNECTOR MOTION, AMPLITUDE=CYCLE_13
*OUTPUT, HISTORY
*ELEMENT OUTPUT, ELSET=C13
CU, CUE, CUP, CUPEQ, CEF, CRF, CALPHAF
********************** TEST 14 *****************************
*AMPLITUDE, NAME=CYCLE_14, DEFINITION=PERIODIC
1,31.4,0,0
0,1,
*BOUNDARY
141,1,6,
*CONNECTOR MOTION, AMPLITUDE=CYCLE_14
*OUTPUT, HISTORY
*ELEMENT OUTPUT, ELSET=C14
CU, CUE, CUP, CUPEQ, CEF, CRF, CALPHAF
********************** TEST 15 *****************************
*AMPLITUDE, NAME=CYCLE_15, DEFINITION=PERIODIC
1,31.4,0,0
0,1,
*BOUNDARY
151,1,6,
*CONNECTOR MOTION, AMPLITUDE=CYCLE_15
*OUTPUT, HISTORY
*ELEMENT OUTPUT, ELSET=C15
CU, CUE, CUP, CUPEQ, CEF, CRF, CALPHAF
********************** TEST 16 *****************************
*AMPLITUDE, NAME=CYCLE_16, DEFINITION=PERIODIC
1,31.4,0,0
0,1,
*BOUNDARY
161,1,6,
*CONNECTOR MOTION, AMPLITUDE=CYCLE_16
*OUTPUT, HISTORY
*ELEMENT OUTPUT, ELSET=C16
CU, CUE, CUP, CUPEQ, CEF, CRF, CALPHAF
********************** TEST 21 *****************************
*AMPLITUDE, NAME=CYCLE_21, DEFINITION=PERIODIC
1,31.4,0,0
0,1,
*BOUNDARY
211,1,6,
*CONNECTOR MOTION, AMPLITUDE=CYCLE_21
*OUTPUT, HISTORY
*ELEMENT OUTPUT, ELSET=C21
CU, CUE, CUP, CUPEQ, CEF, CRF, CALPHAF
********************** TEST 22 *****************************
*AMPLITUDE, NAME=CYCLE_22, DEFINITION=PERIODIC
1,31.4,0,0
0,1,
*BOUNDARY
221,1,6,
*CONNECTOR MOTION, AMPLITUDE=CYCLE_22
*OUTPUT, HISTORY
*ELEMENT OUTPUT, ELSET=C22
CU, CUE, CUP, CUPEQ, CEF, CRF, CALPHAF
********************** TEST 23 *****************************
*AMPLITUDE, NAME=CYCLE_23, DEFINITION=PERIODIC
1,31.4,0,0
0,1,
*BOUNDARY
231,1,6,
*CONNECTOR MOTION, AMPLITUDE=CYCLE_23
*OUTPUT, HISTORY
*ELEMENT OUTPUT, ELSET=C23
CU, CUE, CUP, CUPEQ, CEF, CRF, CALPHAF
********************** TEST 24 *****************************
*AMPLITUDE, NAME=CYCLE_24, DEFINITION=PERIODIC
1,31.4,0,0
0,1,
*BOUNDARY
241,1,6,
*CONNECTOR MOTION, AMPLITUDE=CYCLE_24
*OUTPUT, HISTORY
*ELEMENT OUTPUT, ELSET=C24
CU, CUE, CUP, CUPEQ, CEF, CRF, CALPHAF
********************** TEST 25 *****************************
*AMPLITUDE, NAME=CYCLE_25, DEFINITION=PERIODIC
1,31.4,0,0
0,1,
*BOUNDARY
251,1,6,
*CONNECTOR MOTION, AMPLITUDE=CYCLE_25
*OUTPUT, HISTORY
*ELEMENT OUTPUT, ELSET=C25
CU, CUE, CUP, CUPEQ, CEF, CRF, CALPHAF
********************** TEST 26 *****************************
*AMPLITUDE, NAME=CYCLE_26, DEFINITION=PERIODIC
1,31.4,0,0
0,1,
*BOUNDARY
261,1,6,
*CONNECTOR MOTION, AMPLITUDE=CYCLE_26
*OUTPUT, HISTORY
*ELEMENT OUTPUT, ELSET=C26
CU, CUE, CUP, CUPEQ, CEF, CRF, CALPHAF
********************** TEST 31 *****************************
*AMPLITUDE, NAME=CYCLE_31, DEFINITION=PERIODIC
1,31.4,0,0
0,1,
*BOUNDARY
311,1,6,
*CONNECTOR MOTION, AMPLITUDE=CYCLE_31
*OUTPUT, HISTORY
*ELEMENT OUTPUT, ELSET=C31
CU, CUE, CUP, CUPEQ, CEF, CRF, CALPHAF
********************** TEST 32 *****************************
*AMPLITUDE, NAME=CYCLE_32, DEFINITION=PERIODIC
1,31.4,0,0
0,1,
*BOUNDARY
321,1,6,
*CONNECTOR MOTION, AMPLITUDE=CYCLE_32
*OUTPUT, HISTORY
*ELEMENT OUTPUT, ELSET=C32
CU, CUE, CUP, CUPEQ, CEF, CRF, CALPHAF
********************** TEST 33 *****************************
*AMPLITUDE, NAME=CYCLE_33, DEFINITION=PERIODIC
1,31.4,0,0
0,1,
*BOUNDARY
331,1,6,
*CONNECTOR MOTION, AMPLITUDE=CYCLE_33
*OUTPUT, HISTORY
*ELEMENT OUTPUT, ELSET=C33
CU, CUE, CUP, CUPEQ, CEF, CRF, CALPHAF
********************** TEST 34 *****************************
*AMPLITUDE, NAME=CYCLE_34, DEFINITION=PERIODIC
1,31.4,0,0
0,1,
*BOUNDARY
341,1,6,
*CONNECTOR MOTION, AMPLITUDE=CYCLE_34
*OUTPUT, HISTORY
*ELEMENT OUTPUT, ELSET=C34
CU, CUE, CUP, CUPEQ, CEF, CRF, CALPHAF
********************** TEST 35 *****************************
*AMPLITUDE, NAME=CYCLE_35, DEFINITION=PERIODIC
1,31.4,0,0
0,1,
*BOUNDARY
351,1,6,
*CONNECTOR MOTION, AMPLITUDE=CYCLE_35
*OUTPUT, HISTORY
*ELEMENT OUTPUT, ELSET=C35
CU, CUE, CUP, CUPEQ, CEF, CRF, CALPHAF
********************** TEST 36 *****************************
*AMPLITUDE, NAME=CYCLE_36, DEFINITION=PERIODIC
1,31.4,0,0
0,1,
*BOUNDARY
361,1,6,
*CONNECTOR MOTION, AMPLITUDE=CYCLE_36
*OUTPUT, HISTORY
*ELEMENT OUTPUT, ELSET=C36
CU, CUE, CUP, CUPEQ, CEF, CRF, CALPHAF
********************** TEST 46 *****************************
*AMPLITUDE, NAME=CYCLE_46, DEFINITION=PERIODIC
1,31.4,0,0
0,1,
*BOUNDARY
461,1,6,
*CONNECTOR MOTION, AMPLITUDE=CYCLE_46
*OUTPUT, HISTORY
*ELEMENT OUTPUT, ELSET=C46
CU, CUE, CUP, CUPEQ, CEF, CRF, CALPHAF
********************** TEST 56 *****************************
*AMPLITUDE, NAME=CYCLE_56, DEFINITION=PERIODIC
1,31.4,0,0
0,1,
*BOUNDARY
561,1,6,
*CONNECTOR MOTION, AMPLITUDE=CYCLE_56
*OUTPUT, HISTORY
*ELEMENT OUTPUT, ELSET=C56
CU, CUE, CUP, CUPEQ, CEF, CRF, CALPHAF
*************************************************************
*END STEP