*HEADING
 ADIABATIC MISES PLASTICITY, UNIAXIAL TENSION TEST, C3D8
*NODE,NSET=ALLN
*ELEMENT,TYPE=C3D8,ELSET=ALLE
*SOLID SECTION,ELSET=ALLE,MATERIAL=ALLE
*MATERIAL,NAME=ALLE
** IMAGINARY PROPERTIES
*ELASTIC
 30.E6,.3
*PLASTIC
 30.E3, 0.0
 50.E3, 0.2
 50.E3, 2.0
*DENSITY
 1000.,
*SPECIFIC HEAT
 0.4,
*INELASTIC HEAT FRACTION
*BOUNDARY
 1,PINNED
 2,2
 5,2
 6,2
 4,1
 5,1
 8,1
 2,3
 3,3
*STEP,INC=20
*STATIC,DIRECT,ADIABATIC
 1.,20.
*BOUNDARY
 7,3,,.5
 5,3,,.5
 6,3,,.5
 8,3,,.5
*EL PRINT
 S,
 SINV,
 E,
 PE,
 EE,
 MISES, PEEQ, TEMP, PENER
*NODE PRINT
 U,
 RF,
*OUTPUT,FIELD
*ELEMENT OUTPUT
S,
E,
TEMP,ENER
*END STEP