*HEADING
DRUCKER-PRAGER/LINEAR ELASTICITY, UNIAXIAL COMPRESSION TEST, 3D
*NODE,NSET=ALLN
*ELEMENT,TYPE=C3D8,ELSET=ALLE
*SOLID SECTION,ELSET=ALLE,MATERIAL=ALLE
*MATERIAL,NAME=ALLE
*ELASTIC
300.E3,.3
*DRUCKER PRAGER
*DRUCKER PRAGER HARDENING
*BOUNDARY
1,PINNED
2,2
5,2
6,2
4,1
5,1
8,1
2,3
3,3
*STEP,INC=20
*STATIC,DIRECT
1.,20.
*BOUNDARY
7,3,,-.2
5,3,,-.2
6,3,,-.2
8,3,,-.2
*EL PRINT
S,
SINV,
E,
PE,
EE,
*NODE PRINT
U,
RF,
*OUTPUT,FIELD,FREQ=10
*ELEMENT OUTPUT
S,E,PE
*END STEP