*HEADING
DRUCKER-PRAGER/LINEAR ELASTICITY, K=.78 UNIAXIAL TENSION WITH TEMP, 3D
*NODE,NSET=ALLN
*ELEMENT,TYPE=C3D8R,ELSET=ALLE
*SOLID SECTION,ELSET=ALLE,MATERIAL=ALLE
*MATERIAL,NAME=ALLE
*ELASTIC
300.E3,.3
*DRUCKER PRAGER
*DRUCKER PRAGER HARDENING,TYPE=TENSION
*INITIAL CONDITIONS,TYPE=TEMPERATURE
ALLN,20.
*BOUNDARY
1,PINNED
2,2
5,2
6,2
4,1
5,1
8,1
2,3
3,3
*STEP,INC=20
*STATIC,DIRECT
0.1,1.
*BOUNDARY
7,3,,.2
5,3,,.2
6,3,,.2
8,3,,.2
*EL PRINT,FREQ=0
S,
SINV,
E,
PE,
EE,
*NODE PRINT,FREQ=0
U,
RF,
*OUTPUT,FIELD,FREQ=10
*ELEMENT OUTPUT
S,E,PE,SINV
*END STEP