*HEADING
DRUCKER-PRAGER/LINEAR ELASTICITY, SHEAR CRITERION=EXP, UT, 2D, CPS4
*NODE,NSET=ALLN
*ELEMENT,TYPE=CPS4,ELSET=ALLE
*SOLID SECTION,ELSET=ALLE,MATERIAL=ALLE
*MATERIAL,NAME=ALLE
*ELASTIC
300.E3,.3
*DRUCKER PRAGER,SHEAR CRITERION=EXPONENT
*DRUCKER PRAGER HARDENING
*BOUNDARY
1,PINNED
2,2
4,1
*STEP,INC=20
*STATIC,DIRECT
1.,20.
*BOUNDARY
3,2,,.2
4,2,,.2
*EL PRINT
S,
SINV,
E,
PE,
EE,
*NODE PRINT
U,
RF,
*OUTPUT,FIELD,FREQ=10
*ELEMENT OUTPUT
S,E,PE
*END STEP