*HEADING
CAST IRON PLASTICITY, COUPLED TEMPERATURE DISPLACEMENT, CAX4T
*NODE,NSET=ALL
*ELEMENT,TYPE=CAX4T,ELSET=METAL
*SOLID SECTION,ELSET=METAL,MATERIAL=EL
*MATERIAL,NAME=EL
*ELASTIC
14.773E6,0.2273
*CAST IRON PLASTICITY
*CAST IRON TENSION HARDENING
*CAST IRON COMPRESSION HARDENING
*EXPANSION
11.E-06,
*CONDUCTIVITY
9.4,
*SPECIFIC HEAT
47.52,
*DENSITY
439.92,
*INITIAL CONDITIONS,TYPE=TEMPERATURE
ALL,0
*BOUNDARY
1, 1,2
2, 2,2
4, 1,1
*STEP,INC=100,AMP=RAMP
*COUPLED TEMPERATURE-DISPLACEMENT,DELTMX=60.
1.E-03,1.
*BOUNDARY
3,11,11,600.
4,11,11,600.
*DLOAD
METAL,P3,-30.E+03
*EL PRINT, ELSET=METAL,FREQUENCY=10
S,MISES
E,
PE,
PEEQT,
TEMP,
*NODE PRINT, FREQUENCY=10
U,RF,NT,RFL
*OUTPUT,FIELD,FREQ=10
*ELEMENT OUTPUT
S,E,PE
PEEQT,
TEMP,
*OUTPUT,FIELD,FREQ=10
*NODE OUTPUT
U,
RF,
NT,
RFL,
*END STEP